program: Gaussian 09
title: 000157099
version: EM64L-G09RevD.01
frameworkgroup: C1[X(C9H10N2O5S)]
method: RPBEPBE
basis: SDD
operation: Freq
keyword: #p
keyword: freq=noraman
keyword: PBEPBE/SDD
title: #p freq=noraman PBEPBE/SDD
converged: YES YES NO NO
title: Mulliken charges:
elementType: S O O O O O N N C C C C C C C C C H H H H H H H H H H
charge: 0.966315 -0.558199 -0.504682 -0.458728 -0.226235 -0.270624 -0.462507 -0.598950 -0.182121 0.338175 -0.235765 -0.501127 -0.329594 -0.211829 -0.212517 0.143498 0.227535 0.358741 0.306329 0.297111 0.276190 0.278083 0.246061 0.244332 0.325970 0.340600 0.403938
chargesum: 0.00000
title: Mulliken charges with hydrogens summed into heavy atoms:
elementType: S O O O O O N N C C C C C C C C C
charge: 0.966315 -0.558199 -0.504682 -0.054790 -0.226235 -0.270624 -0.103766 0.067619 -0.182121 0.338175 0.070565 0.072174 -0.051510 0.034233 0.031815 0.143498 0.227535
polarizability: 1.79793214e+02 -9.04532644e+00 1.62833731e+02 1.85661547e+01 1.24264688e+01 1.15440973e+02
1716.lowfreq: -19.5063 -11.0314 -8.1476 -0.0007 0.0011 0.0017 10.4784 17.6939 23.5222
frequency: -15.3787 17.4699 23.2453 51.8895 76.6013 110.7586 139.1551 148.4881 172.1821 202.7117 225.7359 248.2915 254.9451 270.3484 293.6510 352.6975 370.0649 389.8651 415.9924 447.6182 461.2610 466.7908 503.5138 528.7296 536.7122 559.0361 597.1634 611.3219 634.8902 638.7731 678.6383 744.3442 755.0799 766.6513 790.7000 798.4790 861.6240 907.7889 948.0893 976.2175 985.2254 987.6692 1009.8499 1016.5646 1055.4580 1057.3309 1102.4766 1117.2879 1170.4904 1175.3435 1210.6829 1258.5230 1259.5125 1307.2845 1338.5246 1376.4398 1380.5794 1422.1227 1424.8133 1456.2893 1566.4017 1600.8603 1603.4189 1649.4468 1652.1972 2972.6060 3025.6861 3142.0358 3151.3271 3161.1234 3175.6935 3337.6160 3515.0944 3543.1393 3666.7656
redmass: 8.4842 7.0612 4.6370 6.5233 7.5106 4.7368 5.8533 7.8992 7.1804 4.6536 6.2194 6.5751 6.3910 3.6735 7.6513 4.2490 7.1560 6.2391 3.7326 4.4406 1.9878 3.4672 4.5797 4.1143 1.2603 1.6092 3.5557 4.1946 1.4713 5.6449 4.4526 2.9614 4.3868 2.9554 1.5193 7.7731 2.3276 1.3721 10.4596 2.6873 1.4827 4.1835 1.3606 4.5112 2.1387 2.0625 3.7631 1.7780 1.5296 1.0883 1.0879 1.3816 1.3551 2.1412 2.2157 1.7371 6.9204 1.6984 1.2883 2.5550 6.0169 1.5259 6.4391 3.4965 7.7433 1.0594 1.1004 1.0864 1.0900 1.0945 1.1008 1.0741 1.0449 1.0643 1.1044
irintensity: 10.6492 1.4980 2.3382 4.0619 3.5424 2.4351 2.7109 3.1822 6.5597 1.6042 7.1640 5.6172 3.5587 18.9418 2.3248 13.9112 20.0766 24.9222 28.5578 41.8787 25.7883 6.8937 14.2830 14.0246 182.1941 70.8788 21.1279 18.7202 92.1807 36.7371 50.1586 25.0346 15.4783 49.3598 46.5059 46.6555 93.5863 1.0130 96.7695 5.1019 4.1658 16.9077 0.5646 88.4745 33.1519 30.8146 13.0312 16.1953 86.9066 2.6380 69.2094 7.0607 9.6532 87.4508 134.4531 27.4520 3.5604 47.8437 17.5694 4.5967 9.7697 35.5539 24.9108 475.9840 122.7776 30.0063 1.4572 7.1070 1.0154 3.4652 20.7872 59.0905 42.9754 66.2087 28.0646
temp: 298.150 k
press: 1.00000 atm
elementType: 16 8 8 8 8 8 7 7 6 6 6 6 6 6 6 6 6 1 1 1 1 1 1 1 1 1 1
symmnumber: 1
zpe: 495573.4 jmol-1
zpe.correction: 0.188754 hartree
zpe.thermalcorrener: 0.205207 hartree
zpe.thermalcorrenthalpy: 0.206151 hartree
zpe.thermalcorrgfe: 0.143116 hartree
zpe.sumelectzpe: -1231.222206 hartree
zpe.sumelectthermal: -1231.205752 hartree
zpe.sumelectthermalent: -1231.204808 hartree
zpe.sumelectthermalfe: -1231.267844 hartree
dipole: 3.5448 5.4034 -2.7165
dipole: 7.0101
quadrupole: -85.9708 -96.6974 -118.3255
quadrupole: -1.1646 -6.2899 10.7127
quadrupole: 14.3604 3.6339 -17.9943 -1.1646 -6.2899 10.7127
hfenergy: -1231.4109596 hartree
pointgroup: C01 [X(C9H10N2O5S1)]
dipole: -1.2250875 -1.7348342 -1.7595361 debye
polarizability: 171.1333967|5.1662347|164.5113318|-30.697037|5.1412585|122.4231889 unknown
InChI: InChI=1S/C9H10N2O5S/c10-8(12)5-11-17(15,16)7-4-2-1-3-6(7)9(13)14/h1-4,11,13H,5,10H2
charge 0 multiplicity 1
27 atoms
S  -0.313311 0.127288 1.538553
O  -0.812746 -1.260204 2.248046
O  0.34137 1.300325 2.433893
O  0.295366 2.333173 -0.343609
O  2.482404 2.713792 -1.018088
O  -1.867685 -0.368872 -1.830187
N  -1.85777 0.802253 0.71555
N  -3.560937 -1.87094 -1.292889
C  0.976053 -0.44995 0.207017
C  1.740858 0.430511 -0.593727
C  1.171603 -1.838782 0.199963
C  -2.852577 -0.235544 0.422192
C  2.750891 -0.139862 -1.414342
C  2.166023 -2.384615 -0.643879
C  2.959549 -1.533008 -1.444499
C  1.589646 1.912753 -0.666669
C  -2.705252 -0.829745 -0.999239
H  -1.511474 1.306804 -0.125776
H  0.568421 -2.467038 0.863891
H  -2.767943 -1.027721 1.193301
H  -3.85536 0.223241 0.530343
H  3.356772 0.539029 -2.023121
H  2.325939 -3.46764 -0.659282
H  3.738824 -1.952664 -2.088494
H  -4.20911 -2.250133 -0.604047
H  -3.529629 -2.286008 -2.2242
H  0.261575 3.324256 -0.2784
