program: Gaussian 09
title: 000157094
version: EM64L-G09RevD.01
frameworkgroup: C1[X(C15H15NO)]
method: RPBEPBE
basis: SDD
operation: Freq
keyword: #p
keyword: freq=noraman
keyword: PBEPBE/SDD
title: #p freq=noraman PBEPBE/SDD
converged: YES YES NO NO
title: Mulliken charges:
elementType: O N C C C C C C C C C C C C C C C H H H H H H H H H H H H H H H
charge: -0.232282 -0.141439 -0.178281 -0.585667 0.247892 0.166712 0.525425 -0.137195 -0.428460 -0.359342 -0.619648 -0.195863 -0.424050 -0.377540 -0.233248 -0.226842 -0.243777 0.224195 0.213525 0.219601 0.225059 0.257713 0.244060 0.224992 0.225893 0.226504 0.257593 0.210035 0.244826 0.220634 0.223986 0.224990
chargesum: 0.00000
title: Mulliken charges with hydrogens summed into heavy atoms:
elementType: O N C C C C C C C C C C C C C C C
charge: -0.232282 -0.141439 0.045914 -0.152541 0.247892 0.166712 0.525425 0.087864 -0.170747 -0.115282 0.057741 0.061730 -0.214015 -0.132715 -0.012614 -0.002856 -0.018787
polarizability: 1.63567972e+02 2.83774172e+01 1.81988002e+02 2.22574478e+01 -4.22707245e+00 1.39869063e+02
1716.lowfreq: -9.2863 -5.6946 -0.0011 -0.0008 -0.0007 4.9036 19.1144 42.4381 52.7956
frequency: 18.3384 42.3939 52.7848 79.4132 103.8265 133.8031 178.1822 201.6613 251.1894 288.4374 302.9673 358.9090 403.6588 405.6635 427.2538 467.1541 493.0441 505.0007 587.1964 592.3746 617.8987 629.5587 677.6834 682.7346 701.0908 707.0570 732.7969 738.6254 752.6109 807.9580 847.1418 848.0524 867.5444 881.9966 886.5665 915.0895 919.7698 957.4589 970.3962 989.9584 991.3291 993.1608 1027.2077 1031.8700 1078.5464 1088.5045 1111.5964 1131.6992 1148.3396 1168.5672 1173.3038 1186.4262 1189.4994 1206.0808 1226.6085 1229.6908 1254.3060 1293.6517 1327.7890 1345.0979 1359.4852 1382.5120 1414.4195 1431.6060 1440.2286 1447.0490 1457.4918 1468.0359 1483.9486 1489.8851 1499.0152 1589.9997 1592.1954 1613.5644 1620.6220 2898.0540 2945.1078 2984.1343 3018.3417 3037.7295 3082.5624 3105.4351 3121.5182 3132.6907 3144.0764 3154.2762 3160.8536 3206.9011 3215.8468 3268.9835
redmass: 4.1369 4.3533 4.8739 3.9685 1.2635 4.2329 2.5588 4.0217 4.3326 4.6545 3.1459 1.9796 2.9554 5.2742 3.4776 3.6516 4.7643 4.1821 3.8721 4.0923 6.2707 4.3897 1.5294 1.7519 1.8107 2.0655 4.1791 3.3015 2.4126 3.1737 1.3118 1.3195 3.0014 2.7108 1.6183 3.0459 1.8376 2.0471 1.3960 3.6316 1.6131 2.7930 2.1975 1.9053 1.8283 1.6955 1.3132 1.7354 1.3057 1.2125 1.2429 1.9745 1.1366 2.4044 1.5674 1.3213 3.0948 1.9469 1.2821 1.5835 1.5510 7.9517 2.0223 2.4152 2.1493 1.7223 1.0856 1.1105 2.3428 2.1854 1.4783 7.1731 6.4431 6.1204 6.2500 1.0840 1.0391 1.0601 1.0961 1.1021 1.0983 1.0873 1.0856 1.0913 1.0958 1.0904 1.1014 1.0938 1.0967 1.1043
irintensity: 0.2514 0.1171 0.1208 0.8273 1.0186 2.3202 1.0101 4.2667 8.7673 0.6396 0.6236 0.2838 0.4956 7.4062 1.4999 4.6642 4.5436 5.4776 14.3285 1.7545 0.2956 15.5939 82.2086 44.8359 53.3280 3.0294 4.5687 12.5030 15.3278 1.3066 6.9517 9.5870 8.0329 5.5998 1.3774 14.5710 10.6573 4.1509 1.1344 0.2498 2.1107 27.3068 5.9792 38.6791 29.4963 14.5045 8.9949 26.0782 7.6148 8.0791 8.8682 8.3174 1.0301 13.2666 1.5587 31.0030 8.6545 25.8981 0.9228 24.9116 32.0023 0.5050 11.5328 2.4108 7.0778 8.9597 13.2292 12.5753 19.3176 2.9954 17.0514 80.8059 26.2973 14.6218 114.9496 75.4593 108.6732 56.0441 43.4313 20.2175 19.3844 14.9528 0.5457 19.0982 38.7799 6.1874 21.2124 4.3030 4.6013 0.1044
temp: 298.150 k
press: 1.00000 atm
elementType: 8 7 6 6 6 6 6 6 6 6 6 6 6 6 6 6 6 1 1 1 1 1 1 1 1 1 1 1 1 1 1 1
symmnumber: 1
zpe: 681842.0 jmol-1
zpe.correction: 0.259700 hartree
zpe.thermalcorrener: 0.274219 hartree
zpe.thermalcorrenthalpy: 0.275164 hartree
zpe.thermalcorrgfe: 0.216669 hartree
zpe.sumelectzpe: -709.315635 hartree
zpe.sumelectthermal: -709.301116 hartree
zpe.sumelectthermalent: -709.300172 hartree
zpe.sumelectthermalfe: -709.358666 hartree
dipole: 0.9702 2.5021 -1.3636
dipole: 3.0101
quadrupole: -103.6060 -87.0117 -96.3531
quadrupole: 3.4757 8.3595 1.0212
quadrupole: -7.9490 8.6452 -0.6962 3.4757 8.3595 1.0212
hfenergy: -709.5753352 hartree
pointgroup: C01 [X(C15H15N1O1)]
dipole: -0.3849144 0.9685734 0.5623449 debye
polarizability: 160.4847654|-29.0957603|182.8094705|22.0009669|4.3307237|142.1308013 unknown
InChI: InChI=1S/C15H15NO/c1-16-9-7-15-13(8-10-17-15)14(16)11-12-5-3-2-4-6-12/h2-10,14H,11H2,1H3
charge 0 multiplicity 1
32 atoms
O  2.606185 -1.530314 -0.894816
N  0.630497 2.032841 -0.102457
C  0.830531 1.105408 1.054932
C  -0.530682 0.666549 1.738695
C  1.669416 -0.067934 0.603852
C  1.840824 -0.358757 -0.747724
C  -1.508577 -0.054067 0.828928
C  0.781305 1.645346 -1.432504
C  2.356298 -1.096353 1.347771
C  1.37036 0.458258 -1.827858
C  0.101943 3.362759 0.219006
C  2.910088 -1.966339 0.418818
C  -2.606071 0.637056 0.252674
C  -1.344042 -1.431012 0.521263
C  -3.509877 -0.019933 -0.61249
C  -2.243435 -2.091305 -0.344452
C  -3.329451 -1.388821 -0.916774
H  1.370318 1.682201 1.841367
H  -1.005828 1.567405 2.173579
H  -0.240382 0.018443 2.588728
H  0.423694 2.370476 -2.170115
H  2.436052 -1.189782 2.430233
H  1.482737 0.19053 -2.877421
H  -0.984709 3.352447 0.443444
H  0.271965 4.051703 -0.6255
H  0.628271 3.771697 1.103331
H  3.504354 -2.872561 0.485587
H  -2.761716 1.697222 0.492656
H  -0.505636 -1.9840 0.960125
H  -4.353652 0.53162 -1.043202
H  -2.098032 -3.153685 -0.571542
H  -4.028748 -1.9028 -1.586032
