program: Gaussian 09
title: 000157083
version: EM64L-G09RevD.01
frameworkgroup: C1[X(C15H16N2O)]
method: RPBEPBE
basis: SDD
operation: Freq
keyword: #p
keyword: freq=noraman
keyword: PBEPBE/SDD
title: #p freq=noraman PBEPBE/SDD
converged: YES YES NO NO
title: Mulliken charges:
elementType: O N N C C C C C C C C C C C C C C C H H H H H H H H H H H H H H H H
charge: -0.288614 -0.270504 -0.517649 0.421251 0.499331 0.253370 0.498106 -0.659982 -0.360695 -0.711256 -0.318730 -0.373527 -0.391236 -0.207819 -0.809086 -0.225074 -0.227440 -0.251569 0.326964 0.215742 0.308982 0.267764 0.252046 0.224707 0.295155 0.237668 0.229481 0.222713 0.219092 0.231702 0.231516 0.225701 0.223607 0.228282
chargesum: 0.00000
title: Mulliken charges with hydrogens summed into heavy atoms:
elementType: O N N C C C C C C C C C C C C C C C
charge: -0.288614 -0.270504 -0.190685 0.421251 0.499331 0.253370 0.498106 -0.444240 -0.051713 0.033261 -0.023575 -0.135859 -0.161754 0.014894 -0.126775 0.000628 -0.003833 -0.023287
polarizability: 3.04762630e+02 -2.84837445e+00 1.80523992e+02 -6.63986037e+00 -7.63080726e+00 8.54884313e+01
1716.lowfreq: -5.3016 -0.0006 -0.0004 0.0004 3.1912 9.1085 18.3481 32.9197 35.3857
frequency: 17.4299 32.9129 35.3677 53.6408 67.7058 92.8434 143.7301 189.4128 210.8129 222.1633 227.2649 230.7791 303.4749 313.3597 357.8262 388.2838 402.2848 413.6779 441.6213 508.5061 515.4236 527.7314 553.6260 599.4558 609.7771 615.5514 652.0559 695.7630 699.4922 702.5857 731.5600 765.5257 801.8574 820.9972 833.9839 866.4090 889.1915 906.9476 917.9603 959.7335 966.4068 983.0199 985.1610 989.3575 992.7261 1012.6089 1030.9925 1046.3566 1084.8715 1095.6248 1099.4058 1112.1237 1137.8886 1173.1205 1181.6330 1193.1567 1195.3468 1221.2727 1274.7430 1311.5367 1313.1163 1329.8686 1380.2411 1380.5443 1396.0342 1411.8561 1439.9001 1442.4816 1469.4215 1469.8618 1485.3928 1488.9627 1494.5013 1495.5690 1526.6711 1586.9663 1603.0757 1607.9146 1618.4081 1627.0565 2943.2158 2976.8396 3047.3086 3056.6296 3080.9181 3092.6123 3102.4759 3122.9942 3125.2963 3135.1126 3147.7680 3148.6442 3164.3881 3202.3966 3206.9754 3546.1299
redmass: 3.8399 1.3043 2.4771 5.6988 4.3510 4.5877 3.8208 3.6323 2.9750 4.6572 2.2456 2.0336 3.1860 5.0026 3.6001 3.4266 3.3605 2.9505 2.8207 4.4213 3.5314 4.2399 2.2919 2.2356 2.8501 6.3374 5.8859 1.9187 2.7028 4.7017 5.9174 1.8073 1.3747 5.1567 1.2483 1.4661 4.1413 1.4666 1.3811 2.2123 1.3668 4.4385 4.3057 1.4287 1.3427 1.9845 2.1582 1.5517 1.6979 1.5646 1.6982 1.4890 2.4985 1.0533 1.0904 1.8678 1.1304 3.0369 2.6548 2.6644 1.4855 1.5837 6.0725 7.0289 1.2856 2.4836 1.3308 1.9337 1.1378 1.3843 1.9032 1.2836 1.5816 1.0585 1.9080 6.1888 6.1298 5.3319 6.3231 5.6086 1.0466 1.0369 1.0894 1.0977 1.0990 1.0910 1.0983 1.0872 1.0846 1.0891 1.0962 1.0941 1.1004 1.0945 1.0944 1.0755
irintensity: 0.6577 0.5928 0.0682 7.7667 0.3369 0.1595 1.7921 1.8890 4.1751 1.9379 2.3071 0.5343 4.1369 8.9042 2.1429 0.6394 1.8834 0.8461 8.0033 11.1462 3.2760 7.9002 14.8837 15.9294 43.7440 2.2112 0.2883 41.8059 38.5108 2.0386 3.3711 71.0798 61.3289 3.5017 0.9278 16.6287 12.7413 7.7505 9.4848 11.3955 1.4108 0.7006 1.3128 0.4898 3.4143 1.3045 33.9279 14.0645 6.3717 18.3163 85.8277 41.2339 137.0445 1.6935 4.0420 31.1050 0.8026 168.7557 120.9657 47.6178 156.3790 89.0844 160.4473 35.0306 32.4329 56.6672 44.7205 14.2433 66.7340 185.8820 248.5981 175.9299 11.2845 35.6051 243.3630 2.2042 45.3046 42.7324 171.2578 101.3015 54.3380 40.4130 24.1613 21.1894 14.5058 30.2550 16.3429 8.7925 2.8199 9.6665 26.8748 38.9096 25.0781 7.3787 4.3583 9.7118
temp: 298.150 k
press: 1.00000 atm
elementType: 8 7 7 6 6 6 6 6 6 6 6 6 6 6 6 6 6 6 1 1 1 1 1 1 1 1 1 1 1 1 1 1 1 1
symmnumber: 1
zpe: 724181.1 jmol-1
zpe.correction: 0.275826 hartree
zpe.thermalcorrener: 0.292454 hartree
zpe.thermalcorrenthalpy: 0.293399 hartree
zpe.thermalcorrgfe: 0.229216 hartree
zpe.sumelectzpe: -764.652403 hartree
zpe.sumelectthermal: -764.635774 hartree
zpe.sumelectthermalent: -764.634830 hartree
zpe.sumelectthermalfe: -764.699013 hartree
dipole: -0.5346 4.4657 0.5095
dipole: 4.5263
quadrupole: -92.1080 -94.9065 -112.0687
quadrupole: 0.4776 -0.2428 -1.3693
quadrupole: 7.5864 4.7879 -12.3743 0.4776 -0.2428 -1.3693
hfenergy: -764.9282287 hartree
pointgroup: C01 [X(C15H16N2O1)]
dipole: -0.2043392 -1.7601249 -0.1772513 debye
polarizability: 304.7659005|3.3639483|180.3330882|6.190168|-8.8422551|85.676064 unknown
InChI: InChI=1S/C15H16N2O/c1-12-7-6-8-13(11-12)16-15(18)17(2)14-9-4-3-5-10-14/h3-11,16H,1-2H3
charge 0 multiplicity 1
34 atoms
O  0.393983 1.4218 -0.134104
N  1.416031 -0.698476 -0.407369
N  -0.923434 -0.521813 -0.122513
C  2.768117 -0.249181 -0.178679
C  -2.232903 0.040078 -0.076023
C  0.29995 0.161657 -0.217763
C  -4.656188 -0.43693 0.07172
C  -3.315851 -0.878145 0.026751
C  -2.497999 1.432381 -0.131378
C  1.218631 -2.111511 -0.797283
C  3.184457 1.082973 -0.451825
C  3.724513 -1.182331 0.310219
C  -4.912068 0.958686 0.008059
C  -3.84007 1.870054 -0.092157
C  -5.801385 -1.429755 0.183644
C  4.527824 1.45701 -0.23515
C  5.067101 -0.797124 0.511274
C  5.479805 0.52638 0.240186
H  -0.895306 -1.535818 -0.011109
H  -3.108162 -1.956979 0.070557
H  -1.667807 2.13693 -0.190166
H  2.131611 -2.47657 -1.29236
H  0.396847 -2.190219 -1.530425
H  1.00806 -2.781801 0.063045
H  2.455644 1.809556 -0.810961
H  3.421954 -2.204125 0.56253
H  -5.945774 1.323045 0.040781
H  -4.045044 2.945902 -0.135388
H  -5.437241 -2.470299 0.239184
H  -6.409624 -1.237118 1.087195
H  -6.480667 -1.356882 -0.686451
H  4.831173 2.487816 -0.450732
H  5.785236 -1.532059 0.892309
H  6.520987 0.827069 0.398683
