program: Gaussian 09
title: 000157077
version: EM64L-G09RevD.01
frameworkgroup: C1[X(C23H26O11)]
method: RPBEPBE
basis: SDD
operation: Freq
keyword: #p
keyword: freq=noraman
keyword: PBEPBE/SDD
title: #p freq=noraman PBEPBE/SDD
converged: YES YES NO NO
title: Mulliken charges:
elementType: O O O O O O O O O O O C C C C C C C C C C C C C C C C C C C C C C C H H H H H H H H H H H H H H H H H H H H H H H H H H
charge: -0.281317 -0.272978 -0.289649 -0.450480 -0.458645 -0.459711 -0.213750 -0.285954 -0.238907 -0.239544 -0.462923 -0.112137 -0.340983 0.012071 -0.061057 -0.172242 -0.166041 -0.109416 0.017352 -0.455110 0.170719 -0.325254 -0.330002 -0.017034 -0.260918 0.129035 -0.604920 0.156678 0.294785 -0.507460 -0.394348 0.323120 -0.183062 -0.358877 0.251011 0.246455 0.228210 0.313768 0.247489 0.233845 0.233119 0.228512 0.257622 0.215844 0.209457 0.236849 0.238923 0.262554 0.265669 0.294551 0.362520 0.371627 0.370791 0.230453 0.222739 0.277831 0.265549 0.232542 0.254711 0.396320
chargesum: 0.00000
title: Mulliken charges with hydrogens summed into heavy atoms:
elementType: O O O O O O O O O O O C C C C C C C C C C C C C C C C C C C C C C C
charge: -0.281317 -0.272978 -0.289649 -0.087960 -0.087018 -0.088920 -0.213750 -0.285954 -0.238907 -0.239544 -0.066603 0.138873 -0.094528 0.240281 0.252711 0.075247 0.067804 0.123703 0.245863 0.018356 0.170719 0.121052 0.171475 0.248635 0.033633 0.129035 -0.151728 0.156678 0.294785 -0.229628 -0.128800 0.323120 0.049480 -0.104166
polarizability: 3.27709635e+02 -1.21187191e+00 3.08833048e+02 -1.95246293e+01 1.03813612e+01 2.17172180e+02
1716.lowfreq: -6.7360 -0.0009 -0.0009 -0.0007 3.0114 5.1988 17.6241 24.1170 28.7591
frequency: 17.4935 24.0185 28.7407 41.3074 43.4891 54.7212 58.3569 64.6204 70.9394 79.5843 89.8668 100.2062 115.4304 119.6625 132.4349 147.4980 158.6693 185.1652 191.2772 204.6200 214.1749 219.7821 232.4233 236.5482 250.8087 260.3648 270.5537 281.9931 295.1397 314.8249 346.6515 348.7948 362.3796 373.8123 386.4301 400.8469 410.3198 414.2469 420.5243 424.6097 430.6503 436.4935 452.6572 466.1828 482.8045 485.3111 506.5914 521.9462 543.4887 551.4676 558.6844 576.8706 587.9238 591.7270 607.6634 614.1416 650.5942 661.7971 675.2745 683.4929 695.6007 721.3469 725.5924 761.4729 770.1674 801.4641 811.2965 855.8620 863.9832 877.0280 892.7898 895.2753 907.0857 915.8248 919.9812 923.0561 947.6384 958.7738 961.0189 962.3760 970.9621 983.7531 985.8924 1000.0024 1006.7457 1015.0893 1018.4882 1029.4703 1033.1087 1040.9728 1044.8693 1053.9831 1057.3892 1061.6451 1070.3833 1080.6864 1089.7046 1108.5925 1113.2863 1134.3047 1141.1812 1156.3028 1168.1347 1174.2584 1180.3868 1190.4609 1200.4817 1207.5508 1209.0522 1217.4525 1227.0486 1234.5337 1245.3605 1256.2841 1267.4264 1277.8893 1280.2379 1293.5961 1299.5408 1299.9156 1303.5914 1306.3986 1317.1713 1323.1192 1332.1189 1338.7909 1340.8002 1351.8836 1359.4617 1365.4584 1367.9919 1368.4627 1371.6747 1393.7683 1401.7462 1407.9060 1432.8196 1434.2635 1456.6750 1466.7574 1479.3074 1497.1822 1603.6289 1607.1952 1611.0590 1632.9227 1650.9595 1658.3972 2952.7330 2956.4152 2961.8470 2968.0562 2986.2653 2994.9900 3004.1071 3006.5872 3026.2947 3030.2109 3068.3591 3087.9312 3094.8617 3100.5626 3102.6685 3105.5704 3142.0274 3162.8579 3164.8884 3176.1658 3182.4118 3199.9885 3404.7405 3550.0959 3566.9488 3579.5680
redmass: 6.6204 6.6871 6.6347 7.2477 5.3237 5.0828 6.3077 4.4622 5.5066 6.0453 6.0676 7.1586 6.2382 5.5831 5.3559 6.0350 4.9132 4.4427 4.5831 2.9139 4.2166 6.1175 4.6255 4.4963 3.4690 3.0113 3.8644 4.0224 5.3052 3.5947 3.1908 5.3450 1.9157 2.2820 4.1715 4.3430 4.5606 3.8512 1.2725 2.8899 2.6156 2.0033 2.7512 5.2937 4.4991 4.7655 5.4726 6.4014 4.9137 5.4452 3.2636 3.4066 4.8871 3.4968 1.2118 3.4424 4.9361 5.7853 4.7104 2.9778 4.5433 3.4125 2.7767 4.6823 6.9609 2.9831 1.5735 3.0112 3.7543 5.8343 1.7767 2.1115 1.5003 1.4412 2.6969 3.0413 4.3683 4.7260 4.0202 1.4135 3.0649 1.6443 3.3563 4.4636 1.4305 2.5377 2.4028 3.2794 3.5564 2.6194 3.0257 2.8015 2.7716 2.5649 2.4813 2.8040 2.0005 3.1221 2.7095 2.3396 2.4227 2.7405 1.1250 1.2927 1.7499 2.0862 1.1831 1.5203 1.3083 1.5398 1.1794 1.4068 1.3192 1.3031 1.3187 1.2238 2.1022 1.2660 1.2278 1.2694 1.2679 1.2587 1.2127 1.4102 1.4479 1.3628 1.4219 1.4990 1.5274 1.5848 1.3291 1.4363 1.5646 1.3801 1.8663 6.3707 1.2424 2.5953 1.0907 1.0821 1.0889 2.5142 7.9716 8.6794 5.8681 10.3984 9.3627 4.6622 1.0817 1.0834 1.0827 1.0823 1.0853 1.0665 1.0613 1.0853 1.0581 1.0849 1.1008 1.0609 1.1009 1.0888 1.1068 1.0938 1.0873 1.0914 1.0925 1.0989 1.0952 1.1139 1.0675 1.0657 1.0658 1.0661
irintensity: 1.6382 2.8179 0.3925 0.3159 1.4010 1.6898 0.1178 1.7798 1.3532 2.3393 0.5303 1.7609 6.4180 0.1699 1.5734 2.0598 2.5816 1.2322 1.2574 5.1183 6.8835 6.4777 0.6091 1.2890 8.0923 3.8426 11.9361 1.5941 12.8563 2.9493 1.1276 4.1585 94.0500 69.3559 0.0444 19.8742 3.3542 12.3490 93.2003 50.6601 43.7985 94.4577 43.7925 4.6990 25.7245 1.7123 5.7416 4.9639 9.6953 5.4612 35.1702 28.0342 25.6612 21.7221 184.1887 7.4586 5.4749 2.9259 39.0187 9.8471 15.8642 63.4731 17.5688 70.0419 24.9030 13.9707 24.0096 14.9330 106.5190 22.3722 34.8408 19.8746 9.2330 5.0933 216.6924 10.3838 84.7550 143.0199 78.6967 160.7402 0.7447 1.1625 9.4191 188.2199 1.8748 78.3704 192.5715 43.5183 97.5837 12.5652 110.5224 21.4435 16.2317 135.2895 66.6703 35.3037 74.4910 15.0782 24.9344 36.4481 9.2415 46.1650 37.2218 14.2535 64.0370 253.8468 22.6141 38.8820 21.3266 224.3614 22.3729 103.3549 4.4095 21.2807 23.6689 2.8390 64.5862 35.5313 4.8530 12.6961 13.3074 41.1850 2.7217 0.2645 5.2171 6.3455 12.8692 6.2502 1.6024 4.0106 8.0704 0.9700 3.5346 1.1097 23.0766 28.4326 8.0606 74.0746 8.5696 19.8202 9.8365 6.1368 478.6734 58.9081 37.4496 139.5540 138.8991 6.3755 13.9858 5.6499 15.0652 2.7154 43.6334 47.6470 19.4867 56.5257 17.4822 10.6983 25.7069 7.5395 28.4158 3.8856 7.0358 3.0851 10.0504 7.7033 1.3230 13.3942 0.9111 12.8540 490.3523 24.7623 25.7488 11.5976
temp: 298.150 k
press: 1.00000 atm
elementType: 8 8 8 8 8 8 8 8 8 8 8 6 6 6 6 6 6 6 6 6 6 6 6 6 6 6 6 6 6 6 6 6 6 6 1 1 1 1 1 1 1 1 1 1 1 1 1 1 1 1 1 1 1 1 1 1 1 1 1 1
symmnumber: 1
zpe: 1219185.0 jmol-1
zpe.correction: 0.464363 hartree
zpe.thermalcorrener: 0.496437 hartree
zpe.thermalcorrenthalpy: 0.497382 hartree
zpe.thermalcorrgfe: 0.399891 hartree
zpe.sumelectzpe: -1716.898511 hartree
zpe.sumelectthermal: -1716.866436 hartree
zpe.sumelectthermalent: -1716.865492 hartree
zpe.sumelectthermalfe: -1716.962983 hartree
dipole: 1.3776 -2.8881 5.1174
dipole: 6.0355
quadrupole: -236.1591 -183.2531 -204.9552
quadrupole: 2.3673 33.7999 0.7686
quadrupole: -28.0366 24.8694 3.1673 2.3673 33.7999 0.7686
hfenergy: -1717.362874 hartree
pointgroup: C01 [X(C23H26O11)]
dipole: 1.0185687 -0.8472436 1.9705634 debye
polarizability: 324.024143|6.5999995|310.9827648|-25.2904704|2.7098383|218.707956 unknown
InChI: InChI=1S/C23H26O11/c1-2-13-14-6-7-30-21(29)15(14)9-32-22(13)34-23-19(27)18(26)17(25)16(33-23)10-31-20(28)11-4-3-5-12(24)8-11/h2-5,8-9,13-14,16-19,22-27H,1,6-7,10H2
charge 0 multiplicity 1
60 atoms
O  1.251785 -1.051626 0.519722
O  -0.974332 -1.836188 0.461747
O  0.931784 0.813593 -0.987762
O  2.15721 -3.703058 -0.466958
O  0.234408 -5.806204 0.107067
O  -2.488586 -5.08542 -0.521445
O  5.706418 1.918542 -0.54218
O  -3.522129 -0.986652 -0.292723
O  4.683626 1.900437 -2.581731
O  -5.0361 -0.337415 1.365871
O  -0.884806 3.083495 -1.463866
C  3.260278 0.971655 0.818954
C  1.802073 1.14968 1.349997
C  0.358982 -1.999831 -0.122091
C  0.855557 0.340801 0.44022
C  0.885041 -3.409783 0.199371
C  -0.108553 -4.454345 -0.337898
C  -1.545986 -4.195285 0.151297
C  -1.944751 -2.748495 -0.198155
C  4.309503 1.83467 1.546968
C  3.318948 1.255979 -0.676404
C  5.680437 1.582805 0.912363
C  -3.337784 -2.34272 0.266127
C  1.343128 2.596415 1.425253
C  2.205243 1.163858 -1.458807
C  4.576462 1.691919 -1.351767
C  0.92603 3.195142 2.56678
C  -4.22904 -0.033793 0.456635
C  -3.832114 1.343022 0.041456
C  -2.586759 1.538126 -0.605581
C  -4.649917 2.451937 0.371045
C  -2.140005 2.846013 -0.893094
C  -4.212777 3.751871 0.029617
C  -2.962159 3.959646 -0.59409
H  3.526008 -0.094905 0.982762
H  1.734899 0.700334 2.358065
H  0.318865 -1.811861 -1.218117
H  -0.210587 0.459847 0.685068
H  0.975231 -3.495751 1.302064
H  -0.093378 -4.403421 -1.449528
H  -1.575473 -4.342571 1.252228
H  -1.887053 -2.614402 -1.300218
H  4.049903 2.906354 1.477491
H  4.351879 1.57223 2.621215
H  5.981064 0.521486 1.014387
H  6.466704 2.220864 1.345704
H  -3.426098 -2.309252 1.366915
H  -4.091625 -3.033203 -0.146617
H  1.350047 3.170502 0.487593
H  2.207885 1.385781 -2.529266
H  2.851039 -3.085646 -0.123885
H  1.158421 -6.004171 -0.192188
H  -2.142627 -6.010731 -0.427768
H  0.591186 4.237887 2.574129
H  0.894971 2.660158 3.52488
H  -1.982894 0.663546 -0.865855
H  -5.600038 2.285069 0.887305
H  -4.843531 4.616316 0.262923
H  -2.606144 4.964399 -0.841082
H  -0.348474 2.241448 -1.489143
