program: Gaussian 09
title: 000157073
version: EM64L-G09RevD.01
frameworkgroup: C1[X(C19H15NO3)]
method: RPBEPBE
basis: SDD
operation: Freq
keyword: #p
keyword: freq=noraman
keyword: PBEPBE/SDD
title: #p freq=noraman PBEPBE/SDD
converged: YES YES NO NO
title: Mulliken charges:
elementType: O O O N C C C C C C C C C C C C C C C C C C C H H H H H H H H H H H H H H H
charge: -0.437511 -0.136572 -0.177257 -0.458904 0.052380 0.262086 0.091143 0.206262 -0.194607 -0.120941 0.206227 0.276061 0.238149 -0.529380 -0.794812 -0.372753 0.437176 -0.385632 -0.377075 -0.354635 -0.210872 -0.210249 -0.830749 0.304394 0.238820 0.264528 0.307343 0.196650 0.346599 0.227591 0.276144 0.276867 0.228045 0.240375 0.240180 0.223550 0.223970 0.227409
chargesum: 0.00000
title: Mulliken charges with hydrogens summed into heavy atoms:
elementType: O O O N C C C C C C C C C C C C C C C C C C C
charge: -0.090912 -0.136572 -0.177257 -0.154509 0.052380 0.262086 0.091143 0.206262 -0.194607 -0.120941 0.206227 0.276061 0.238149 -0.290559 -0.026291 -0.145162 0.437176 -0.109488 -0.100207 -0.126590 0.029503 0.029931 -0.155820
polarizability: 2.55289225e+02 -2.41991095e+00 2.71111556e+02 -7.12740276e+00 -8.63671738e+00 1.65080967e+02
1716.lowfreq: -6.0259 -4.7714 -0.0007 0.0003 0.0003 3.1170 23.6995 31.9089 43.9357
frequency: 23.6206 31.9061 43.8782 47.2306 77.2855 94.9659 108.3887 123.9599 140.9357 155.1780 181.5309 196.8465 209.2799 230.0963 238.9957 270.6789 301.1105 311.0195 346.6866 350.8948 375.3237 402.7964 430.3100 431.9791 442.1042 449.7226 512.8504 521.4165 539.9950 553.0514 576.7062 592.1659 621.1297 648.5041 673.8475 678.1447 698.3518 704.0567 757.2774 764.8460 790.2989 796.7891 801.6928 840.0321 854.2143 868.4736 870.5894 910.3305 930.5518 936.4889 949.4785 974.7917 982.3199 996.2788 1011.2082 1014.7725 1030.8016 1046.0723 1047.5543 1082.1265 1093.5161 1121.7354 1139.1964 1172.4680 1180.5379 1201.9228 1236.7213 1239.0994 1246.3091 1281.8730 1289.1551 1316.6575 1323.4532 1395.6611 1398.6846 1404.7903 1410.3277 1431.0015 1448.8449 1451.9829 1452.9465 1457.4263 1469.1038 1470.0253 1490.1163 1493.4346 1545.2889 1589.4440 1591.1403 1594.6952 1622.3732 1635.4039 1653.7065 2971.9981 2984.0502 3048.5058 3071.4634 3079.7678 3091.2352 3119.4554 3136.7339 3143.8945 3149.2679 3160.8202 3163.2089 3171.3553 3540.6890 3597.2291
redmass: 4.5712 5.4819 1.0616 1.1066 3.9053 4.6642 3.1276 3.5781 2.7405 6.4728 2.4387 4.7802 3.6097 4.2432 4.9374 4.0634 4.8462 8.9306 3.3724 3.9714 5.8604 3.5605 4.4070 3.1216 4.6965 5.2868 5.5781 5.4948 8.2189 1.1809 5.3136 2.8903 5.2040 5.0870 5.7326 5.9347 5.4977 6.4505 4.0268 2.7720 2.2540 3.3440 1.4162 4.6317 6.1551 5.6067 1.5057 1.4877 5.0610 1.3419 6.8479 2.1871 1.5162 1.5075 1.3619 2.1080 2.0268 1.5234 1.4925 2.5397 4.1091 3.9848 1.3656 1.1396 1.9708 2.2913 3.0383 1.3866 2.5123 1.6080 2.0484 1.7793 3.5599 1.6199 2.1383 7.7065 1.4076 1.9730 3.0791 2.4167 2.5073 1.2736 1.3581 1.4985 1.1942 1.6252 5.8361 5.7241 7.8564 7.4960 9.7083 6.9147 12.6725 1.0372 1.0371 1.0976 1.0984 1.0984 1.0983 1.0870 1.0863 1.0972 1.0901 1.0956 1.0907 1.1004 1.0659 1.0804
irintensity: 2.0774 1.7895 0.5461 1.3242 0.3217 5.5237 12.9957 2.0268 14.3090 2.0368 21.7888 5.2683 1.8093 2.7518 7.1288 7.2749 24.9517 8.9034 1.1505 3.0948 1.7991 0.8230 2.2579 2.9165 0.1449 1.9030 5.4155 3.8576 1.3577 75.5767 17.7276 20.1215 33.8515 3.1024 2.2541 1.0010 20.6934 14.1982 2.3835 3.1900 29.4571 15.2443 52.8186 13.2203 5.0623 13.9447 4.6672 1.0596 78.7994 1.0937 35.0146 0.6539 9.0007 10.8622 0.0344 2.0282 15.3414 4.5435 14.3800 2.7074 40.6358 17.8805 2.4906 16.3631 2.8234 29.3017 160.0548 14.6214 9.1334 4.6709 45.1908 5.8335 22.9272 5.1996 10.6493 10.0321 45.3094 87.5944 0.3872 0.1687 1.2886 26.8930 38.3403 34.3531 10.3133 8.1507 57.5890 19.5876 168.3888 2.5601 127.1204 4.1345 114.5698 48.4662 41.5317 22.3373 14.8365 19.6596 3.9985 8.4309 1.6164 33.0062 4.4480 5.6007 6.6267 23.9617 9.4929 60.7065
temp: 298.150 k
press: 1.00000 atm
elementType: 8 8 8 7 6 6 6 6 6 6 6 6 6 6 6 6 6 6 6 6 6 6 6 1 1 1 1 1 1 1 1 1 1 1 1 1 1 1
symmnumber: 1
zpe: 758867.0 jmol-1
zpe.correction: 0.289037 hartree
zpe.thermalcorrener: 0.309397 hartree
zpe.thermalcorrenthalpy: 0.310342 hartree
zpe.thermalcorrgfe: 0.239054 hartree
zpe.sumelectzpe: -1011.862039 hartree
zpe.sumelectthermal: -1011.841679 hartree
zpe.sumelectthermalent: -1011.840734 hartree
zpe.sumelectthermalfe: -1011.912022 hartree
dipole: 0.4407 -1.7589 -3.5262
dipole: 3.9651
quadrupole: -113.3829 -119.8238 -137.7575
quadrupole: -15.0708 4.1155 0.5408
quadrupole: 10.2719 3.8309 -14.1028 -15.0708 4.1155 0.5408
hfenergy: -1012.151076 hartree
pointgroup: C01 [X(C19H15N1O3)]
dipole: 0.3347617 0.6459105 1.3799584 debye
polarizability: 257.2228692|5.6124196|269.0799881|4.3010449|-10.8761341|165.178891 unknown
InChI: InChI=1S/C19H15NO3/c1-10-7-8-15-14(9-10)16(11(2)20-15)19(23)17(21)12-5-3-4-6-13(12)18(19)22/h3-9,20,23H,1-2H3
charge 0 multiplicity 1
38 atoms
O  0.218615 -2.411808 -1.947219
O  1.035741 0.332329 -2.714356
O  1.533023 -2.925726 0.73718
N  -2.832876 -1.359448 0.785345
C  0.45702 -1.369404 -0.957149
C  -0.865822 -1.024006 -0.300995
C  -1.508452 0.273001 -0.113807
C  -1.70974 -2.003486 0.264404
C  1.184649 -0.118084 -1.552275
C  1.447266 -1.792911 0.19667
C  -2.742031 0.023493 0.583398
C  2.14781 0.370214 -0.5237
C  2.287714 -0.599502 0.505494
C  -1.201963 1.619381 -0.460454
C  -1.597173 -3.500045 0.315287
C  -3.635428 1.051006 0.946182
C  -2.081198 2.665776 -0.10742
C  2.891793 1.567521 -0.501702
C  3.169423 -0.389972 1.585409
C  -3.289145 2.369975 0.597771
C  3.77043 1.784323 0.583522
C  3.907176 0.815214 1.616843
C  -1.76148 4.105507 -0.478034
H  -3.61118 -1.841633 1.231171
H  -0.299459 1.864182 -1.027116
H  -1.820851 -3.939126 -0.673595
H  -0.570071 -3.805046 0.573689
H  -2.295172 -3.927805 1.058348
H  1.055676 -2.59953 -2.44578
H  -4.57001 0.83611 1.476516
H  2.786445 2.300045 -1.308407
H  3.276281 -1.148832 2.366898
H  -3.964359 3.192283 0.863959
H  4.359919 2.706342 0.632212
H  4.600925 1.007537 2.442658
H  -0.82247 4.174549 -1.054019
H  -1.651288 4.740043 0.422346
H  -2.564938 4.552236 -1.093775
