program: Gaussian 09
title: 000157071
version: EM64L-G09RevD.01
frameworkgroup: C1[X(C20H12O)]
method: RPBEPBE
basis: SDD
operation: Freq
keyword: #pfreq=noraman
keyword: PBEPBE/SDD
title: #p freq=noraman PBEPBE/SDD
converged: NO YES NO NO
title: Mulliken charges:
elementType: O C C C C C C C C C C C C C C C C C C C C H H H H H H H H H H H H
charge: -0.431559 -0.017231 -0.127343 0.316193 0.298300 0.222263 0.220019 0.234760 0.479651 -0.410947 -0.427707 -0.462664 -0.413534 0.114390 -0.472540 -0.385305 -0.384103 -0.463498 -0.275305 -0.278011 -0.284146 0.231095 0.271773 0.236456 0.231893 0.241468 0.229886 0.232483 0.220632 0.228510 0.230410 0.231209 0.362501
chargesum: 0.00000
title: Mulliken charges with hydrogens summed into heavy atoms:
elementType: O C C C C C C C C C C C C C C C C C C C C
charge: -0.069058 -0.017231 -0.127343 0.316193 0.298300 0.222263 0.220019 0.234760 0.479651 -0.179852 -0.155934 -0.226208 -0.181641 0.114390 -0.231072 -0.155419 -0.151620 -0.242866 -0.046795 -0.047601 -0.052938
polarizability: 3.26451263e+02 -6.03577294e+00 3.09276986e+02 8.70666729e-04 -4.85517412e-04 8.06760495e+01
1716.lowfreq: -9.2848 -0.0011 -0.0006 0.0005 2.4845 8.2556 54.2437 76.6207 104.2456
frequency: 54.2429 76.6192 104.2440 142.9918 202.9319 229.8493 250.6835 273.7167 286.6760 336.8421 345.5661 367.3386 373.1939 413.2625 425.1326 454.9881 458.1175 491.5354 524.4327 533.2030 536.2375 575.9974 583.7865 587.0511 612.7097 638.9783 662.7520 684.2912 713.5044 727.5964 759.6945 765.5696 766.9115 778.4457 810.5267 838.6348 860.9536 863.4029 892.2841 904.7316 916.5159 928.8699 937.9489 953.7589 979.6573 987.9649 997.1541 1037.6344 1046.0314 1074.5325 1078.6804 1102.8895 1150.0328 1158.8733 1178.0543 1194.1033 1207.8051 1212.1087 1241.6450 1259.6330 1270.9190 1286.1066 1317.9114 1322.5981 1376.4059 1387.6315 1391.4133 1417.8503 1423.2382 1425.9868 1446.6546 1473.7074 1478.7054 1504.0248 1527.4588 1570.7986 1592.2521 1594.0949 1610.6164 1617.2637 1631.2476 3114.1925 3125.0339 3128.2091 3130.0615 3140.8636 3145.3349 3153.4822 3162.4003 3167.5718 3172.1950 3174.5858 3584.7489
redmass: 4.5682 4.5334 4.8584 4.3136 3.9084 5.3236 4.5799 5.6383 4.4053 4.3633 7.6380 1.1114 7.1532 6.6505 3.5488 4.6868 3.3989 3.6044 6.1867 6.4949 3.7470 3.1747 4.4602 7.9961 3.3687 6.4710 3.8942 6.3033 6.7090 2.4365 2.2022 5.7581 1.3325 1.7300 1.8234 1.8208 1.5982 6.1474 6.8306 2.1340 1.5987 1.8282 5.7639 1.4002 1.3743 1.3398 1.3573 4.3098 2.5182 3.3569 2.5628 1.7649 1.3316 1.2769 1.1108 1.2971 1.5043 1.6063 1.8359 1.9686 1.7176 2.7417 3.9806 2.1277 6.2030 6.2052 2.6099 3.2490 3.1894 4.2240 2.7545 3.6730 3.0793 3.4181 4.6631 5.1392 7.4555 6.5844 6.3699 6.2799 7.1836 1.0895 1.0864 1.0850 1.0890 1.0899 1.0925 1.0955 1.0974 1.0928 1.0957 1.0955 1.0661
irintensity: 0.1122 0.1073 1.3509 5.3051 3.2785 1.2558 5.6086 6.0759 0.1074 0.1293 3.5022 133.4022 0.0214 0.7486 0.2411 2.8288 3.4637 1.1920 3.7863 4.4155 1.0885 6.2109 3.7297 1.3311 1.1062 2.5278 4.3509 0.4691 4.3162 0.4553 5.3581 4.9840 131.7128 1.9311 41.2387 20.3179 48.0399 4.8886 48.3696 10.2335 2.6154 0.0579 0.6180 0.6950 1.9939 0.0451 0.0923 7.6354 71.2311 1.6602 34.8775 63.0818 20.4629 2.1516 10.4666 70.1350 20.7524 20.5995 3.2944 76.9652 0.9983 17.5001 27.2981 14.2041 9.4638 0.7296 36.0571 2.9841 3.5816 1.8754 27.0380 8.0270 23.1663 17.4041 31.4330 2.0916 47.1257 2.7591 6.2230 0.2489 28.1327 27.5577 1.7363 0.9645 12.1639 24.6334 17.5633 0.1273 4.9760 53.2677 38.2056 7.6928 67.4348
temp: 298.150 k
press: 1.00000 atm
elementType: 8 6 6 6 6 6 6 6 6 6 6 6 6 6 6 6 6 6 6 6 6 1 1 1 1 1 1 1 1 1 1 1 1
symmnumber: 1
zpe: 666434.1 jmol-1
zpe.correction: 0.253831 hartree
zpe.thermalcorrener: 0.268164 hartree
zpe.thermalcorrenthalpy: 0.269108 hartree
zpe.thermalcorrgfe: 0.213269 hartree
zpe.sumelectzpe: -843.233845 hartree
zpe.sumelectthermal: -843.219512 hartree
zpe.sumelectthermalent: -843.218568 hartree
zpe.sumelectthermalfe: -843.274407 hartree
dipole: 0.2018 -1.6689 0.0003
dipole: 1.6811
quadrupole: -103.3075 -94.9014 -129.3194
quadrupole: -7.8104 0.0010 -0.0006
quadrupole: 5.8686 14.2747 -20.1433 -7.8104 0.0010 -0.0006
hfenergy: -843.4876761 hartree
pointgroup: C01 [X(C20H12O1)]
dipole: 0.0383142 0.6602844 -0.0001288 debye
polarizability: 325.6339558|7.0568566|310.0942935|-0.0008387|-0.0005388|80.6760495 unknown
InChI: InChI=1S/C20H12O/c21-18-11-10-16-14-6-2-1-5-13(14)15-7-3-4-12-8-9-17(18)20(16)19(12)15/h1-11,21H
charge 0 multiplicity 1
33 atoms
O  4.178669 1.975181 -0.000175
C  0.854715 0.276305 -0.000127
C  0.343793 -1.077982 -0.000126
C  -0.048877 1.398986 -0.00019
C  -1.075843 -1.327833 -0.000176
C  -1.502343 1.159664 -0.000141
C  -2.010452 -0.18594 -0.000138
C  2.282321 0.487038 -0.000127
C  1.26824 -2.1895 -0.00012
C  0.507531 2.702472 -0.0003
C  3.18231 -0.640932 -0.000064
C  2.690072 -1.93078 -0.000061
C  -1.524213 -2.673857 -0.000289
C  2.781766 1.822383 -0.000196
C  0.768523 -3.520768 -0.000185
C  -2.434848 2.240493 -0.000087
C  -3.423726 -0.383391 -0.000079
C  1.900197 2.9193 -0.000303
C  -0.616038 -3.755742 -0.00029
C  -3.819252 2.021735 -0.000047
C  -4.320474 0.693894 -0.000035
H  -0.143857 3.57991 -0.000424
H  4.257207 -0.442062 -0.000042
H  3.374562 -2.787118 -0.000033
H  -2.594231 -2.897055 -0.000403
H  1.476803 -4.357306 -0.000179
H  -2.072539 3.272137 -0.000062
H  -3.83027 -1.398213 -0.000056
H  2.292092 3.944604 -0.000406
H  -0.99893 -4.782108 -0.000381
H  -4.509174 2.87268 -0.000006
H  -5.400301 0.510276 0.000016
H  4.429166 2.932029 -0.000268
