program: Gaussian 09
title: 000157063
version: EM64L-G09RevD.01
frameworkgroup: C1[X(C18H11F)]
method: RPBEPBE
basis: SDD
operation: Freq
keyword: #pfreq=noraman
keyword: PBEPBE/SDD
title: #p freq=noraman PBEPBE/SDD
converged: NO YES NO YES
title: Mulliken charges:
elementType: F C C C C C C C C C C C C C C C C C C H H H H H H H H H H H
charge: -0.212164 0.022952 0.533550 0.229435 0.179900 0.489574 0.415011 0.039934 -0.791896 -0.508584 -0.472638 -0.380114 -0.385689 -0.437464 -0.437409 -0.249054 -0.250200 -0.236664 -0.236800 0.249034 0.244905 0.236903 0.279250 0.269031 0.239798 0.247012 0.229272 0.230586 0.232392 0.230139
chargesum: 0.00000
title: Mulliken charges with hydrogens summed into heavy atoms:
elementType: F C C C C C C C C C C C C C C C C C C
charge: -0.212164 0.022952 0.533550 0.229435 0.179900 0.489574 0.415011 0.039934 -0.542862 -0.263680 -0.235735 -0.100864 -0.116658 -0.197666 -0.190397 -0.019782 -0.019615 -0.004272 -0.006661
polarizability: 3.86226281e+02 -2.67404009e+00 2.07817289e+02 -1.69226536e-03 3.34931602e-03 7.22432953e+01
1716.lowfreq: -0.0009 -0.0004 0.0010 6.7692 7.5706 17.0372 53.1355 70.1830 128.5568
frequency: 53.0893 70.1782 128.5554 162.6910 170.8979 208.8372 272.4585 284.9952 309.6652 325.7646 349.4667 405.9014 430.5449 440.4776 499.6473 513.5438 527.2825 527.8321 534.5342 563.3468 594.0078 615.9020 629.5270 665.9914 700.0750 751.6881 757.0164 767.2289 775.9546 783.1793 818.1324 829.6510 863.0007 868.8818 890.8114 896.3431 925.4665 962.9038 971.7023 987.3201 987.7344 994.4468 995.7067 1009.0604 1023.6205 1052.8938 1106.9615 1137.4026 1162.6275 1173.4122 1180.4333 1200.6580 1230.8803 1242.6087 1261.9859 1293.7617 1308.8346 1339.8107 1379.1583 1399.2345 1408.6062 1414.6341 1435.1363 1443.3744 1452.1734 1480.1893 1504.1100 1554.8260 1564.3879 1593.8937 1614.3524 1631.1347 1639.8957 3119.7318 3122.0987 3124.9389 3128.3613 3137.4054 3139.7991 3145.7114 3158.0145 3160.1510 3175.0952 3217.9039
redmass: 6.5133 4.2515 4.6804 4.8629 5.2889 4.5712 4.3239 6.7316 10.3600 4.5620 5.8685 3.2703 3.1864 5.8736 7.1275 3.4257 7.8357 3.3641 6.5664 3.1333 6.6688 3.7523 6.3805 6.3047 3.4664 5.9999 1.2388 1.3105 3.1920 5.7980 2.3289 1.5221 4.9292 1.4364 1.6696 6.0641 1.8747 1.3885 1.3924 1.3969 5.5669 1.3310 1.3630 7.3387 2.2934 2.2030 2.3230 1.6701 1.3133 1.0864 1.1164 1.2655 2.0130 1.7771 1.9374 2.2939 1.9409 3.2663 5.0481 3.1991 2.3998 3.2517 3.2316 6.5177 2.3624 2.9477 3.4062 6.4174 7.6766 6.0324 6.0489 7.2186 7.0926 1.0864 1.0868 1.0869 1.0909 1.0907 1.0900 1.0988 1.0958 1.0989 1.0982 1.0925
irintensity: 1.3442 0.1065 0.5831 0.0177 0.9827 3.0985 0.2282 2.1472 1.4650 0.0447 0.3154 3.6052 0.0874 1.1978 0.8156 2.2850 3.5242 25.6665 1.0593 3.8625 7.0360 1.8987 4.7111 0.3052 2.2600 0.9037 0.1294 130.2972 12.6261 2.1242 16.1296 9.2749 0.7194 18.2267 4.8223 0.1752 41.1813 6.2161 11.3341 0.2767 17.0722 0.0130 0.1260 23.9546 8.7882 4.6117 2.1302 1.9378 0.7296 0.7750 1.6271 3.5223 1.1445 20.1945 17.9670 8.8875 3.8681 33.9018 1.4794 6.3368 2.2770 2.3303 4.2811 0.5193 3.3467 13.4581 11.7858 0.0116 3.8500 2.7954 2.1050 5.3742 5.2653 0.0785 4.3263 0.1279 6.5699 13.8200 13.2798 36.8670 31.1652 40.5069 22.0071 6.3968
temp: 298.150 k
press: 1.00000 atm
elementType: 9 6 6 6 6 6 6 6 6 6 6 6 6 6 6 6 6 6 6 1 1 1 1 1 1 1 1 1 1 1
symmnumber: 1
zpe: 602210.0 jmol-1
zpe.correction: 0.229370 hartree
zpe.thermalcorrener: 0.242594 hartree
zpe.thermalcorrenthalpy: 0.243539 hartree
zpe.thermalcorrgfe: 0.189724 hartree
zpe.sumelectzpe: -791.134693 hartree
zpe.sumelectthermal: -791.121469 hartree
zpe.sumelectthermalent: -791.120524 hartree
zpe.sumelectthermalfe: -791.174339 hartree
dipole: -0.3340 1.4831 0.0000
dipole: 1.5202
quadrupole: -87.4263 -96.3131 -116.5670
quadrupole: -0.2686 -0.0002 0.0005
quadrupole: 12.6758 3.7891 -16.4649 -0.2686 -0.0002 0.0005
hfenergy: -791.364063 hartree
pointgroup: C01 [X(C18H11F1)]
dipole: -0.1311947 -0.5835288 -0.0000115 debye
polarizability: 386.2243023|2.7392511|207.8192679|0.001691|0.0033499|72.2432953 unknown
InChI: InChI=1S/C18H11F/c19-18-16-8-4-2-6-13(16)11-14-10-9-12-5-1-3-7-15(12)17(14)18/h1-11H
charge 0 multiplicity 1
30 atoms
F  -0.393372 2.304998 0.000097
C  0.380593 -0.018466 0.000048
C  -0.034542 -1.423195 0.000009
C  1.819545 0.30661 0.000055
C  -2.061169 0.596381 0.000043
C  -2.430774 -0.806877 0.000007
C  2.773389 -0.778517 0.000026
C  -0.676485 0.914338 0.00007
C  -1.398846 -1.779906 -0.000008
C  0.977646 -2.461985 -0.000015
C  2.317746 -2.155606 -0.000008
C  2.33618 1.640301 0.000087
C  -3.088403 1.600652 0.000051
C  4.172126 -0.500893 0.000032
C  -3.82713 -1.150479 -0.000016
C  3.719068 1.889366 0.000102
C  4.649409 0.81679 0.000074
C  -4.43156 1.228266 0.000037
C  -4.805168 -0.158588 -0.000004
H  -1.666475 -2.843253 -0.000035
H  0.638852 -3.504398 -0.000044
H  3.073721 -2.949555 -0.000029
H  1.648307 2.484723 0.000112
H  -2.797591 2.654619 0.00008
H  4.873149 -1.344267 0.000013
H  -4.107259 -2.210492 -0.000039
H  4.078379 2.92432 0.000138
H  5.72594 1.018433 0.000088
H  -5.212373 1.996301 0.000048
H  -5.866302 -0.43042 -0.000017
