program: Gaussian 09
title: 000157043
version: EM64L-G09RevD.01
frameworkgroup: C1[X(C18H12Cl4F2N2O3)]
method: RPBEPBE
basis: SDD
operation: Freq
keyword: #p
keyword: freq=noraman
keyword: PBEPBE/SDD
title: #p freq=noraman PBEPBE/SDD
converged: YES YES NO NO
title: Mulliken charges:
elementType: Cl Cl Cl Cl F F O O O N N C C C C C C C C C C C C C C C C C C H H H H H H H H H H H H
charge: 0.026514 0.015305 -0.023463 -0.001306 -0.221235 -0.154207 -0.252691 -0.200478 -0.156793 -0.502232 -0.497713 -0.108967 -0.314128 -0.450267 -0.276879 0.556934 -0.237181 -0.288019 -0.532575 -0.338578 0.577112 0.289819 -0.089748 0.217047 0.287611 0.258869 -0.374270 -0.379637 -0.145982 0.297649 0.279427 0.260474 0.227000 0.220756 0.253571 0.333828 0.316284 0.338526 0.268317 0.270844 0.250464
chargesum: 0.00000
title: Mulliken charges with hydrogens summed into heavy atoms:
elementType: Cl Cl Cl Cl F F O O O N N C C C C C C C C C C C C C C C C C C
charge: 0.026514 0.015305 -0.023463 -0.001306 -0.221235 -0.154207 -0.252691 -0.200478 -0.156793 -0.185949 -0.159187 0.188682 -0.314128 0.089633 0.170877 0.556934 -0.237181 -0.288019 -0.279003 -0.004750 0.577112 0.289819 -0.089748 0.217047 0.287611 0.258869 -0.105953 -0.108793 0.104482
polarizability: 4.29903781e+02 -9.44481585e+00 2.70791809e+02 -3.18028782e+00 -3.47434250e+00 1.34429002e+02
1716.lowfreq: -4.1922 -1.3986 -0.0017 0.0003 0.0020 2.3781 8.7480 12.2090 12.9361
frequency: 8.6931 12.2056 12.9348 17.5148 26.5297 34.9816 45.9735 55.2899 62.1288 71.4691 82.0889 102.3168 123.0460 142.7021 149.1628 182.8538 186.7273 201.5216 206.6124 227.8370 229.0673 251.6758 252.5674 256.0064 267.2075 282.8066 305.8097 330.2710 350.0262 356.2953 381.6324 402.8640 421.8932 424.8767 444.6184 471.0336 476.4589 493.1241 506.0205 507.3089 542.8621 548.0939 564.3571 570.3809 582.5126 612.5015 621.5336 659.7091 675.7674 685.3711 707.9102 722.9128 749.3615 757.3349 761.7228 785.7478 802.7515 811.3488 849.4809 865.2407 873.0833 882.3815 910.9020 919.3378 933.3340 939.0068 951.6676 968.0058 968.8163 974.8892 1044.5180 1051.9986 1053.0608 1069.5550 1101.3352 1117.4798 1145.4625 1156.3436 1167.8749 1192.0883 1201.5908 1206.3000 1217.2435 1230.3482 1233.1977 1245.6500 1280.3700 1336.5080 1346.8927 1375.4766 1393.5247 1396.5611 1433.6359 1441.0938 1448.4974 1449.7260 1463.0548 1469.3291 1492.8862 1568.1283 1573.9339 1608.0231 1620.4682 1638.0860 1681.5374 2981.1984 3050.3320 3106.6520 3144.2790 3147.8540 3163.7971 3183.5869 3193.9504 3196.9110 3215.0001 3508.5863 3525.9495
redmass: 10.4622 13.7949 10.2052 10.1912 10.7991 10.5534 10.7089 9.3230 9.4448 9.7218 9.5239 9.3632 9.6101 9.2883 15.3166 4.3432 6.0119 4.8933 10.1073 7.3322 4.8775 7.8633 11.8648 8.8273 7.8250 11.9215 8.2797 7.1745 8.6021 4.4401 10.2257 5.7934 5.4529 6.9646 4.6004 4.9312 4.8063 7.0656 5.0619 9.2357 5.0238 7.0329 2.6714 3.0315 2.7048 1.5923 2.0494 4.7660 3.0774 6.1648 6.4209 5.0681 8.4489 2.7387 5.2237 6.3115 2.5740 1.8198 1.5702 7.9316 4.6173 1.3993 1.4072 5.5421 7.2741 7.6200 2.6262 1.4523 1.3370 7.9046 2.9892 1.8969 2.3603 1.4674 2.7233 1.4777 2.0392 2.3648 1.1806 1.7117 2.4118 1.8643 1.2802 6.7896 2.4455 1.5858 3.1112 1.7976 2.8910 11.0070 4.7563 1.8491 2.7685 1.3613 3.1731 2.2212 1.5142 1.5312 2.6900 4.1197 7.0039 7.2295 8.4595 4.9543 7.4465 1.0573 1.1071 1.0567 1.0893 1.0927 1.0883 1.0932 1.0998 1.0934 1.1156 1.0776 1.0767
irintensity: 1.3792 0.2166 0.6380 0.6937 0.9700 1.0452 2.4531 9.3719 2.9229 0.8141 3.1728 1.5535 2.5580 2.5072 0.0875 1.0322 3.8171 0.2549 2.6047 1.2178 0.0619 0.7924 1.0388 0.2977 0.9073 0.6080 2.3448 5.0724 0.5128 3.7125 7.4571 1.2272 5.0390 5.1110 3.3172 9.8282 1.9858 8.1763 1.5484 46.3002 7.5151 5.7294 17.0840 27.8322 15.9055 138.9053 45.5407 6.1778 60.2943 22.9617 61.2093 5.5531 29.9850 29.7333 21.2516 12.8269 79.6554 5.8550 37.5617 3.7338 42.4364 0.4329 28.3086 133.9090 36.2108 45.6925 95.9799 12.5195 1.8905 16.4760 1.2247 38.6911 2.0758 18.2573 25.9248 29.3339 18.5612 652.7511 97.1107 25.8468 10.9584 220.2803 69.6347 117.4699 26.6942 15.3238 71.4708 26.8144 65.8879 2.3640 24.4547 154.9994 114.1224 40.8353 39.1199 1177.9617 160.3141 58.9807 188.7210 159.5765 24.4746 98.9624 105.8290 69.8737 253.0526 30.0231 11.3154 2.3831 0.3848 4.8648 4.1724 0.4651 1.6416 22.4665 1.2467 43.9219 24.6298
temp: 298.150 k
press: 1.00000 atm
elementType: 17 17 17 17 9 9 8 8 8 7 7 6 6 6 6 6 6 6 6 6 6 6 6 6 6 6 6 6 6 1 1 1 1 1 1 1 1 1 1 1 1
symmnumber: 1
zpe: 702401.5 jmol-1
zpe.correction: 0.267531 hartree
zpe.thermalcorrener: 0.295715 hartree
zpe.thermalcorrenthalpy: 0.296659 hartree
zpe.thermalcorrgfe: 0.201212 hartree
zpe.sumelectzpe: -3066.092816 hartree
zpe.sumelectthermal: -3066.064632 hartree
zpe.sumelectthermalent: -3066.063688 hartree
zpe.sumelectthermalfe: -3066.159134 hartree
dipole: 6.1241 7.7461 1.1377
dipole: 9.9398
quadrupole: -144.3239 -202.1960 -194.5058
quadrupole: 22.7940 -35.0579 3.6266
quadrupole: 36.0180 -21.8541 -14.1639 22.7940 -35.0579 3.6266
hfenergy: -3066.3603466 hartree
pointgroup: C01 [X(C18H12Cl4F2N2O3)]
dipole: -2.363098 -3.0797376 0.4733218 debye
polarizability: 429.9444413|-7.6492995|270.4452884|-7.0419658|6.1983505|134.7348627 unknown
InChI: InChI=1S/C18H12Cl4F2N2O3/c19-10-4-9(5-11(20)15(10)29-7-8-6-18(8,21)22)25-17(28)26-16(27)14-12(23)2-1-3-13(14)24/h1-5,8,25-26H,6-7H2
charge 0 multiplicity 1
41 atoms
Cl 9.163041 -0.193326 -1.563987
Cl 7.586222 2.088028 -0.279266
Cl 3.518936 -3.254712 -0.116202
Cl 3.474721 2.295243 -0.472963
F  -4.773852 -2.195252 0.142026
F  -6.657551 2.289303 0.128857
O  4.725541 -0.494444 -0.532206
O  -1.513151 1.728113 0.18334
O  -4.230819 1.719327 1.326147
N  -0.911579 -0.55337 0.141417
N  -3.169097 0.025269 0.091765
C  6.988001 -0.716893 0.250485
C  8.019997 0.300182 -0.204149
C  8.206506 -0.342755 1.153052
C  5.590687 -0.336892 0.674603
C  3.348711 -0.476001 -0.28894
C  2.616072 -1.678582 -0.127339
C  2.592436 0.723808 -0.279471
C  1.220473 -1.700059 0.012437
C  1.19614 0.754049 -0.132226
C  0.500893 -0.475536 0.00829
C  -1.822862 0.515762 0.155581
C  -5.630352 0.088013 0.197871
C  -4.2994 0.702686 0.598991
C  -5.873109 -1.297113 0.02925
C  -6.783609 0.904596 0.03774
C  -7.123124 -1.86696 -0.241616
C  -8.063308 0.394382 -0.241251
C  -8.230633 -1.000202 -0.373899
H  7.038464 -1.683135 -0.262552
H  9.006754 -1.077456 1.271715
H  8.020468 0.285891 2.029617
H  5.53269 0.708876 1.030852
H  5.234088 -1.02644 1.46547
H  0.702091 -2.658696 0.119775
H  0.65037 1.69829 -0.116536
H  -1.289882 -1.489778 0.303154
H  -3.331708 -0.880581 -0.357002
H  -7.216767 -2.950846 -0.343574
H  -8.899498 1.088922 -0.354364
H  -9.221102 -1.412812 -0.585492
