program: Gaussian 09
title: 000157031
version: EM64L-G09RevD.01
frameworkgroup: C1[X(C15H20N2O)]
method: RPBEPBE
basis: SDD
operation: Freq
keyword: #p
keyword: freq=noraman
keyword: PBEPBE/SDD
title: #p freq=noraman PBEPBE/SDD
converged: YES YES NO NO
title: Mulliken charges:
elementType: O N N C C C C C C C C C C C C C C C H H H H H H H H H H H H H H H H H H H H
charge: -0.293630 -0.096103 -0.216010 -0.103279 -0.245792 -0.036211 -0.554382 -0.413768 -0.410602 0.490916 -0.565236 -0.646045 -0.444694 0.125933 -0.043663 -0.148922 -0.345467 -0.590047 0.246381 0.234681 0.181497 0.223327 0.240589 0.227986 0.188144 0.264008 0.251725 0.222079 0.235446 0.244347 0.190353 0.223091 0.234521 0.215295 0.227904 0.241532 0.218329 0.225769
chargesum: 0.00000
title: Mulliken charges with hydrogens summed into heavy atoms:
elementType: O N N C C C C C C C C C C C C C C C
charge: -0.293630 -0.096103 -0.216010 0.143102 -0.011110 0.145286 -0.090465 0.002361 0.105131 0.490916 -0.107712 0.011745 -0.210173 0.125933 0.171632 0.078982 -0.103935 -0.145950
polarizability: 1.93472364e+02 -1.06655740e+01 1.91165642e+02 -1.42987523e+01 -7.89612712e+00 1.27902811e+02
1716.lowfreq: -3.0890 0.0002 0.0006 0.0006 9.3656 23.9611 32.2614 58.5727 63.4626
frequency: 31.8376 58.4975 63.4352 79.7876 107.0725 163.5775 180.8505 204.5110 211.0513 245.6694 278.6347 300.6834 315.7637 341.7068 358.0708 386.5842 398.3761 422.9037 453.5197 471.7968 498.4228 504.4842 525.2616 557.0200 610.7200 636.8381 644.2098 708.0497 730.9935 734.0115 769.7557 793.7503 796.8229 853.5476 870.4485 901.1562 911.7444 917.0215 927.9976 946.9348 962.1179 974.8402 976.6793 1010.6558 1012.7534 1028.1650 1053.1605 1057.7525 1077.6178 1089.6130 1103.5792 1110.8399 1118.1585 1124.7652 1143.3680 1163.3257 1188.4338 1196.6245 1209.2734 1213.3695 1223.9846 1231.5886 1262.3646 1265.5704 1280.1092 1290.3207 1293.5691 1319.5195 1336.8698 1343.7115 1344.5454 1352.9994 1361.2553 1370.4131 1397.6070 1426.9151 1433.8188 1436.6205 1461.1058 1470.2772 1476.7231 1480.9963 1484.7003 1487.2488 1547.7790 1560.4048 1645.5768 1658.3078 2768.2413 2818.1364 2860.8427 2979.6894 2989.4628 3004.4674 3021.3211 3024.2134 3032.0906 3036.5048 3046.3059 3050.2780 3068.5131 3076.4700 3091.5718 3092.5274 3131.7735 3164.2216 3181.4157 3196.0628
redmass: 4.4926 3.5077 5.0130 2.6767 2.8277 2.7430 2.8063 3.4589 1.5115 2.9801 3.8727 3.0204 2.3261 2.6392 2.5545 2.5301 2.9481 2.5016 3.8232 3.3993 4.2443 3.2313 3.6517 4.0335 4.6265 1.5673 4.4321 3.7118 2.2713 3.8075 2.7639 2.3566 3.1523 1.4843 3.0799 2.8046 1.8214 1.7995 1.7865 1.3622 1.9968 2.1587 1.3060 1.1556 2.5461 2.0747 2.1237 2.3812 1.7852 2.3414 1.9294 1.3918 1.6957 1.5704 1.6209 1.6133 2.0157 2.1550 1.5411 1.7836 1.4747 1.5638 1.5016 1.2975 1.3857 1.3321 1.5713 1.5735 1.4763 1.6047 1.4890 1.5183 1.4901 1.3766 2.1977 1.2305 1.5703 1.1690 1.0917 1.1490 1.0796 1.1261 1.0959 1.2461 6.4166 7.4723 7.5528 4.7296 1.0798 1.0705 1.0577 1.0618 1.0611 1.0708 1.0828 1.0844 1.0868 1.0732 1.0953 1.1031 1.0835 1.0930 1.0997 1.0710 1.0884 1.0935 1.0966 1.1148
irintensity: 0.3098 0.0323 2.0542 0.2244 2.5859 1.2135 0.4982 2.4183 0.3549 2.1192 1.6621 1.4440 1.7568 6.6962 3.1089 1.5411 0.2192 1.4006 3.8713 0.3383 2.1423 1.1973 2.4255 3.2585 1.3481 12.1293 0.4223 1.0684 13.7217 5.3587 13.1819 42.0231 24.9185 2.0024 2.2681 4.1890 3.1539 3.5241 2.9515 73.4084 9.1640 9.2442 0.7684 15.7891 10.3440 14.3630 12.2380 1.3554 5.6918 23.8234 5.6299 12.8987 4.6706 32.9010 8.2345 8.7789 7.4964 13.6223 3.4144 2.5588 15.4201 4.2590 11.5537 16.3039 1.6926 0.9322 3.6087 24.7603 3.5193 10.9680 6.5745 7.1080 5.2420 8.1143 2.9825 9.7058 12.0984 2.2481 26.5132 10.6109 6.0019 7.3047 10.1329 14.5920 101.5908 170.2781 216.0115 16.9702 83.4064 117.6688 178.2581 21.7089 31.5166 2.8174 26.9289 50.2680 25.5378 36.1412 3.7618 37.2391 36.4925 8.2646 31.3298 5.0242 20.0153 8.9377 8.3912 27.7020
temp: 298.150 k
press: 1.00000 atm
elementType: 8 7 7 6 6 6 6 6 6 6 6 6 6 6 6 6 6 6 1 1 1 1 1 1 1 1 1 1 1 1 1 1 1 1 1 1 1 1
symmnumber: 1
zpe: 847001.7 jmol-1
zpe.correction: 0.322606 hartree
zpe.thermalcorrener: 0.338622 hartree
zpe.thermalcorrenthalpy: 0.339566 hartree
zpe.thermalcorrgfe: 0.279294 hartree
zpe.sumelectzpe: -766.946141 hartree
zpe.sumelectthermal: -766.930125 hartree
zpe.sumelectthermalent: -766.929181 hartree
zpe.sumelectthermalfe: -766.989453 hartree
dipole: -1.9591 -5.4423 1.5803
dipole: 5.9962
quadrupole: -101.6032 -115.2438 -105.9906
quadrupole: -6.9595 -1.3809 2.6805
quadrupole: 6.0093 -7.6313 1.6220 -6.9595 -1.3809 2.6805
hfenergy: -767.268747 hartree
pointgroup: C01 [X(C15H20N2O1)]
dipole: -0.8752863 2.1140849 -0.5742552 debye
polarizability: 192.6586899|10.3952479|192.4391169|14.4190935|-6.0105889|127.4430105 unknown
InChI: InChI=1S/C15H20N2O/c1-3-5-13-12-8-11(9-16(13)2)14-6-4-7-15(18)17(14)10-12/h3-4,6-7,11-13H,1,5,8-10H2,2H3
charge 0 multiplicity 1
38 atoms
O  1.643712 -2.764649 0.462394
N  -1.03431 1.432992 0.842491
N  1.197958 -0.572537 -0.269493
C  -1.150866 -0.056614 -1.153718
C  0.571854 1.714412 -1.069168
C  -1.96247 0.657582 -0.027781
C  -0.412402 0.990992 -2.011378
C  -0.239889 2.408052 0.061269
C  -0.14613 -1.107782 -0.641641
C  1.583197 0.740697 -0.484631
C  -2.832746 -0.337834 0.790496
C  -1.657612 2.073227 2.019309
C  2.871126 1.151449 -0.139752
C  2.074714 -1.572602 0.31358
C  -3.763027 -1.157041 -0.080838
C  3.77997 0.221121 0.451072
C  3.395089 -1.095092 0.674963
C  -3.842262 -2.511471 -0.090907
H  -1.885861 -0.600553 -1.775406
H  1.130593 2.500132 -1.609499
H  -2.673223 1.360311 -0.551215
H  -1.129864 1.71722 -2.439252
H  0.121209 0.51029 -2.852849
H  0.451948 2.923801 0.752176
H  -0.890196 3.190917 -0.414624
H  -0.527539 -1.652384 0.237249
H  0.023124 -1.882201 -1.413683
H  -3.456059 0.239745 1.501857
H  -2.184759 -0.997875 1.395647
H  -2.047306 1.316226 2.718808
H  -2.49184 2.771899 1.755289
H  -0.887302 2.65253 2.558327
H  3.164433 2.187777 -0.327646
H  -4.435993 -0.579584 -0.736363
H  4.788804 0.55026 0.725762
H  4.066104 -1.832425 1.123763
H  -4.557905 -3.040078 -0.730859
H  -3.193873 -3.130808 0.541353
