program: Gaussian 09
title: 000157028
version: EM64L-G09RevD.01
frameworkgroup: C1[X(C15H23BrO)]
method: RPBEPBE
basis: SDD
operation: Freq
keyword: #p
keyword: freq=noraman
keyword: PBEPBE/SDD
title: #p freq=noraman PBEPBE/SDD
converged: YES YES NO NO
title: Mulliken charges:
elementType: Br O C C C C C C C C C C C C C C C H H H H H H H H H H H H H H H H H H H H H H H
charge: -0.044404 -0.449590 0.287694 -0.316993 -0.536023 0.655836 -0.241529 -0.773964 -0.738137 -0.642585 -0.217399 -0.311183 -0.828043 0.408503 -0.178636 -0.833184 -0.721036 0.214934 0.234978 0.230896 0.215430 0.214156 0.212522 0.234469 0.205741 0.246586 0.212855 0.241020 0.226827 0.207163 0.218615 0.224355 0.227958 0.240796 0.225054 0.275814 0.220922 0.296078 0.303255 0.350248
chargesum: 0.00000
title: Mulliken charges with hydrogens summed into heavy atoms:
elementType: Br O C C C C C C C C C C C C C C C
charge: -0.044404 -0.099341 0.287694 -0.102060 -0.070149 0.655836 -0.026099 -0.112817 -0.072954 -0.174738 -0.010235 -0.092569 -0.375731 0.408503 0.062160 -0.111394 -0.121703
polarizability: 2.33700928e+02 -1.91071582e+01 1.57284659e+02 7.83957199e+00 -1.78221121e+00 1.58822476e+02
1716.lowfreq: -7.0109 -0.0004 0.0003 0.0006 3.2229 9.9927 19.6103 27.9581 35.7995
frequency: 18.6266 26.6106 35.7942 45.4070 77.7459 97.1825 99.0342 118.9662 134.7068 147.8501 193.5416 203.1828 220.8044 235.0199 246.4435 271.2622 280.1365 316.0311 321.1779 343.5001 362.5245 380.0331 392.7468 421.4094 476.5146 488.9231 491.2187 500.6098 544.1709 553.9654 576.6679 638.1356 652.0258 714.5236 726.5675 769.7701 799.3512 831.7370 839.4926 882.7057 892.6735 922.4595 925.9610 938.7829 942.7772 956.7566 961.1872 975.1042 984.3302 995.7011 1001.6050 1010.0041 1030.6237 1044.2910 1051.4570 1089.6094 1139.9843 1143.3069 1144.7764 1165.6829 1169.5793 1176.5107 1198.5018 1211.2379 1228.4486 1247.2727 1273.7690 1282.7530 1302.0528 1313.1551 1315.1836 1318.7311 1353.5362 1370.5335 1372.3425 1374.8046 1395.8289 1397.9445 1422.3304 1436.4125 1445.2646 1454.8844 1462.4609 1466.0363 1468.7788 1478.0162 1481.2684 1492.6126 1664.0536 1670.1223 1677.7533 2930.9793 2966.6382 2968.1851 2970.5059 2971.6139 2974.0577 2977.0785 3012.4231 3039.3472 3056.5823 3058.2796 3061.0732 3063.8035 3070.2785 3078.4924 3080.5656 3081.0746 3089.9140 3098.9004 3117.7722 3155.3312 3181.3812 3511.2790
redmass: 4.9556 4.5112 3.7224 3.9285 3.0359 1.6219 2.6590 2.1636 3.0184 6.1578 3.6082 3.5257 1.0406 2.4837 2.1400 1.7909 1.7864 2.3751 2.7718 2.3948 1.3134 2.2264 2.8818 2.3359 2.9977 2.9351 2.7951 3.0026 3.1738 3.4352 3.1090 3.4247 2.9248 1.4990 1.3238 2.1391 2.7041 1.7235 2.4922 2.3016 2.1127 1.7513 1.7743 1.5517 1.6339 1.6384 1.9223 1.3226 1.7353 1.6034 1.5963 1.8997 2.5075 2.7048 2.0472 1.9278 1.4896 1.7504 1.3762 1.4074 2.2076 1.5464 1.2934 1.1711 1.2494 1.6433 1.7430 1.5304 1.6015 1.7555 1.2783 1.5698 1.6675 1.3661 1.2963 1.2664 1.2729 1.3036 1.1237 1.1577 1.0991 1.0946 1.0504 1.0481 1.0526 1.0547 1.0642 1.0597 6.4181 6.1203 7.1584 1.0681 1.0646 1.0451 1.0563 1.0430 1.0522 1.0852 1.0898 1.0951 1.0845 1.0993 1.0601 1.0983 1.0894 1.0973 1.0653 1.0833 1.0986 1.0993 1.0983 1.1118 1.1136 1.0653
irintensity: 0.1439 0.0696 0.2902 0.4649 1.4104 0.2262 0.4192 0.6152 0.1109 1.8743 3.6909 2.6051 0.0354 1.5110 2.9025 7.2342 0.5487 0.9314 8.1532 3.9416 86.6504 50.5162 1.3476 3.5230 0.5486 6.4171 7.8094 10.1040 6.0066 37.3048 15.5787 52.9064 2.5799 10.7548 29.7646 9.6199 0.8996 28.2304 7.0267 5.6194 0.8997 1.8045 20.7907 43.2436 6.8794 40.8346 28.0439 0.4860 24.5198 11.4079 2.0558 16.5545 12.4060 5.2078 4.2167 7.5128 0.6878 21.9050 4.5409 4.8219 2.1845 12.7647 35.1170 24.1076 20.1813 6.8077 3.7884 1.7463 0.0844 2.7469 14.9679 2.6394 6.9568 10.6319 11.4334 6.1485 15.3238 23.6070 14.1420 7.8392 16.4699 8.8947 5.0303 5.4572 0.7371 5.2943 21.7942 11.3769 1.8010 23.2542 9.9734 22.0628 9.3628 32.1184 9.2909 27.1014 70.6575 26.4460 23.6505 10.3741 17.6342 2.0158 11.7037 70.8906 23.3511 37.5170 16.8270 3.8381 27.7905 16.0466 57.5540 5.3672 18.5004 6.6926
temp: 298.150 k
press: 1.00000 atm
elementType: 35 8 6 6 6 6 6 6 6 6 6 6 6 6 6 6 6 1 1 1 1 1 1 1 1 1 1 1 1 1 1 1 1 1 1 1 1 1 1 1
symmnumber: 1
zpe: 892599.2 jmol-1
zpe.correction: 0.339973 hartree
zpe.thermalcorrener: 0.359909 hartree
zpe.thermalcorrenthalpy: 0.360853 hartree
zpe.thermalcorrgfe: 0.289356 hartree
zpe.sumelectzpe: -672.690374 hartree
zpe.sumelectthermal: -672.670438 hartree
zpe.sumelectthermalent: -672.669494 hartree
zpe.sumelectthermalfe: -672.740991 hartree
dipole: 1.8197 -1.5851 0.4888
dipole: 2.4623
quadrupole: -122.7715 -113.1565 -112.2889
quadrupole: -2.0451 1.1263 -0.4901
quadrupole: -6.6992 2.9158 3.7833 -2.0451 1.1263 -0.4901
hfenergy: -673.0303468 hartree
pointgroup: C01 [X(C15H23Br1O1)]
dipole: -0.7243985 -0.6233883 -0.1583651 debye
polarizability: 234.0541439|18.1189814|156.8441679|8.3062886|2.2666917|158.9097512 unknown
InChI: InChI=1S/C15H23BrO/c1-11-6-5-9-15(3,4)13(11)8-7-12(2)14(17)10-16/h5,7,9,13-14,17H,1,6,8,10H2,2-4H3
charge 0 multiplicity 1
40 atoms
Br 6.139919 -0.451109 0.737314
O  3.772319 1.477741 -0.517787
C  -2.997787 -0.789218 0.209752
C  -1.557724 -0.42024 0.743206
C  -0.421679 -0.997824 -0.165553
C  -1.429802 1.096761 0.862567
C  -3.328487 0.074426 -1.008359
C  -3.101272 -2.290753 -0.177341
C  -4.046302 -0.50743 1.328736
C  -1.617893 1.856313 -0.443248
C  -2.716154 1.25104 -1.30221
C  0.957892 -0.543587 0.25705
C  -1.175499 1.723119 2.039182
C  1.986812 -0.165204 -0.555053
C  3.322574 0.216204 0.087562
C  1.93148 -0.101083 -2.070872
C  4.347372 -0.909305 -0.145552
H  -1.445428 -0.865851 1.753929
H  -0.621621 -0.730679 -1.219082
H  -0.467104 -2.104866 -0.112481
H  -4.127745 -0.299437 -1.665793
H  -2.788189 -2.938632 0.663645
H  -4.149476 -2.544582 -0.424409
H  -2.483109 -2.539788 -1.057366
H  -3.898122 -1.198366 2.181767
H  -3.960356 0.527919 1.699934
H  -5.073777 -0.652333 0.946406
H  -0.662819 1.854598 -1.015665
H  -1.837196 2.922231 -0.238752
H  -3.010441 1.811118 -2.200859
H  1.127121 -0.519553 1.345853
H  -1.038446 1.161467 2.971364
H  -1.092449 2.814711 2.106438
H  3.181394 0.343237 1.180972
H  0.895034 -0.038235 -2.441799
H  2.488506 0.783396 -2.424014
H  2.390908 -0.993893 -2.540533
H  4.041054 -1.856024 0.322847
H  4.595878 -1.040919 -1.209088
H  4.675813 1.686535 -0.16011
