program: Gaussian 09
title: 000157025
version: EM64L-G09RevD.01
frameworkgroup: C1[X(C16H11ClF4N2O6S)]
method: RPBEPBE
basis: SDD
operation: Freq
keyword: #p
keyword: freq=noraman
keyword: PBEPBE/SDD
title: #p freq=noraman PBEPBE/SDD
converged: YES YES NO NO
title: Mulliken charges:
elementType: Cl S F F F F O O O O O O N N C C C C C C C C C C C C C C C C H H H H H H H H H H H
charge: 0.031368 1.050128 -0.167818 -0.156894 -0.156553 -0.157591 -0.258859 -0.485344 -0.537053 -0.233804 -0.196754 -0.175845 -0.634888 0.027150 0.223606 -0.495108 0.233199 0.223244 -0.447101 0.405917 -0.344028 -0.363393 -0.636265 0.279187 0.339680 -0.264685 0.307003 -0.352358 -0.483981 0.277756 0.263764 0.321829 0.360572 0.279789 0.297018 0.278057 0.240532 0.263184 0.248058 0.295084 0.302199
chargesum: 0.00000
title: Mulliken charges with hydrogens summed into heavy atoms:
elementType: Cl S F F F F O O O O O O N N C C C C C C C C C C C C C C C C
charge: 0.031368 1.050128 -0.167818 -0.156894 -0.156553 -0.157591 -0.258859 -0.485344 -0.537053 -0.233804 -0.196754 -0.175845 -0.274316 0.027150 0.223606 0.090485 0.233199 0.223244 -0.167312 0.405917 -0.047010 -0.085336 0.115508 0.279187 0.339680 -0.264685 0.307003 -0.057274 -0.181783 0.277756
polarizability: 3.16252096e+02 -2.08850533e+01 2.97884990e+02 -1.43753619e+01 -6.27893065e+00 1.89050274e+02
1716.lowfreq: -3.4955 -2.7334 -0.0025 -0.0022 -0.0017 5.6381 11.2421 13.0579 14.7510
frequency: 11.0971 12.7613 14.7184 18.0221 23.2103 30.8064 47.1813 47.4926 70.5735 86.1726 87.4529 106.4018 111.4386 114.4539 131.5319 151.1682 153.0330 178.6350 182.9141 196.6613 209.2525 217.2868 231.7745 242.9260 248.5088 256.1838 278.5264 297.1616 303.7333 316.8657 334.8800 344.7977 352.6331 362.8330 388.1980 404.2345 437.3578 452.5169 457.6140 483.4105 496.6709 510.7876 531.6270 533.8339 547.5022 560.5959 575.3076 610.0580 616.5169 633.1224 649.8329 658.0645 664.9695 693.2474 714.6107 737.9671 752.1077 774.0208 788.1469 794.1358 827.7074 838.4232 849.3053 881.6252 884.1133 891.4323 897.2608 924.2927 945.9005 972.0476 985.3729 992.7778 1041.4922 1042.0652 1056.3229 1069.3815 1074.9794 1105.5929 1117.4631 1138.9639 1162.2493 1205.6789 1210.5255 1211.9632 1234.0172 1238.0085 1259.4033 1265.7266 1304.9614 1328.1220 1364.4774 1375.0783 1398.2209 1400.3429 1409.1555 1410.9555 1431.3664 1459.6835 1465.2766 1472.1951 1480.6662 1575.4674 1586.3836 1589.8113 1601.2778 1617.7170 2994.4104 3041.2112 3087.0089 3108.0741 3141.8033 3158.5313 3176.3596 3183.7455 3185.9116 3192.8190 3489.5736
redmass: 13.1450 10.3725 9.5477 15.7062 8.1960 7.1304 7.0717 3.2249 8.5754 8.3611 7.4521 7.2374 7.0910 11.9334 15.3365 8.5687 10.3647 2.8773 2.5723 6.3686 8.8139 6.6905 4.2793 9.1262 3.5123 5.0650 6.9425 6.6365 15.8815 9.5596 10.5131 7.6253 7.2158 8.0391 6.7451 9.0545 8.2921 4.4709 9.2756 8.3583 5.5010 5.0411 5.2281 7.7250 2.6370 8.2718 2.5115 7.2605 11.8243 5.3286 5.6938 5.6784 6.0897 6.6953 5.9156 5.1093 7.4378 10.9988 7.3356 1.1964 9.8332 8.8087 1.4549 1.6982 1.5523 1.3854 5.5385 5.5128 3.9154 1.7462 1.3302 11.9529 4.3716 11.9528 2.6480 2.2597 1.6085 2.2810 7.7455 1.6188 1.8573 2.0935 1.8946 4.6214 1.3107 2.2967 1.2559 1.4782 7.4434 2.4500 8.8749 9.8695 1.1816 6.6081 5.5878 4.8553 1.1060 1.0352 2.9855 4.5757 1.0546 9.0442 9.9842 7.0966 7.9580 7.6423 1.0369 1.0577 1.0964 1.1031 1.1105 1.0921 1.0892 1.0929 1.0941 1.0976 1.0791
irintensity: 0.2961 1.6469 0.3511 0.1592 0.3935 0.7072 0.7559 0.2759 0.8036 3.0574 1.5536 4.2123 4.6972 0.3404 3.8065 4.7172 1.2572 15.3150 5.9399 2.2566 2.1756 2.7672 7.9599 1.5843 1.7692 2.1103 2.0259 11.8656 0.6431 5.3355 8.0965 20.1604 4.2171 5.2540 11.8380 9.8022 0.6517 17.6343 6.6063 11.3897 44.5476 10.6131 0.4040 8.1988 32.9643 16.1181 91.0644 8.4461 29.2220 19.1243 1.8268 15.8566 31.1768 6.3491 32.4256 3.5842 59.4280 8.1414 38.4165 5.8354 108.7247 4.5248 29.1253 36.4089 43.1602 10.0393 141.8587 49.3579 59.0448 41.6002 1.1988 204.8858 30.0033 144.5531 38.8336 3.0000 12.9574 12.7679 210.7088 25.0677 167.4776 109.3929 65.2171 360.3296 4.1060 43.3249 9.4862 26.3385 583.1207 315.9615 184.2679 20.0318 25.7945 2.4382 56.0698 99.5340 6.9263 19.8179 79.6042 59.6088 14.1920 28.6584 205.5981 216.4815 56.3905 1.5912 7.5797 3.8703 6.5762 7.4329 5.5300 2.8264 0.5018 4.9625 5.2038 3.7152 37.2999
temp: 298.150 k
press: 1.00000 atm
elementType: 17 16 9 9 9 9 8 8 8 8 8 8 7 7 6 6 6 6 6 6 6 6 6 6 6 6 6 6 6 6 1 1 1 1 1 1 1 1 1 1 1
symmnumber: 1
zpe: 667481.8 jmol-1
zpe.correction: 0.254230 hartree
zpe.thermalcorrener: 0.284162 hartree
zpe.thermalcorrenthalpy: 0.285107 hartree
zpe.thermalcorrgfe: 0.186766 hartree
zpe.sumelectzpe: -2432.194429 hartree
zpe.sumelectthermal: -2432.164497 hartree
zpe.sumelectthermalent: -2432.163552 hartree
zpe.sumelectthermalfe: -2432.261893 hartree
dipole: -6.7310 -0.7767 1.4758
dipole: 6.9345
quadrupole: -239.1640 -179.4274 -186.0269
quadrupole: 13.4525 4.9356 17.1608
quadrupole: -37.6246 22.1120 15.5125 13.4525 4.9356 17.1608
hfenergy: -2432.4486589 hartree
pointgroup: C01 [X(C16H11Cl1F4N2O6S1)]
dipole: -2.5759592 -0.5573259 0.7050963 debye
polarizability: 320.4526732|-19.8680242|290.0371778|-14.2970007|-18.8850336|192.6975091 unknown
InChI: InChI=1S/C16H11ClF4N2O6S/c1-2-30(27,28)22-15(24)10-7-9(3-4-13(10)23(25)26)29-14-11(17)5-8(6-12(14)18)16(19,20)21/h3-7,22H,2H2,1H3
charge 0 multiplicity 1
41 atoms
Cl -3.117096 -2.38509 2.652562
S  3.199346 3.095341 -0.632506
F  -1.4813 -0.999383 -2.073606
F  -5.79377 1.606613 -1.622104
F  -6.591265 1.030863 0.427311
F  -5.000515 2.631304 0.235615
O  -1.340168 -2.616645 0.238184
O  4.809347 3.052786 -0.525475
O  2.48783 3.718918 -1.951295
O  2.945697 0.811649 1.629799
O  4.987645 -3.031999 -0.097926
O  4.772052 -0.765088 -0.272774
N  2.451089 1.341996 -0.59616
N  4.283117 -1.951894 -0.123026
C  2.014152 -0.921396 0.192604
C  2.447482 3.846227 1.002394
C  2.57568 0.469491 0.471568
C  2.814242 -2.075956 0.005919
C  0.613187 -1.080439 0.263614
C  0.048752 -2.368649 0.145337
C  2.245058 -3.366269 -0.08695
C  0.852191 -3.518452 -0.019473
C  3.052464 5.225962 1.226834
C  -2.272964 -1.57899 0.131833
C  -4.346623 0.323881 -0.15883
C  -3.233441 -1.393374 1.154962
C  -2.403214 -0.795098 -1.041356
C  -4.267362 -0.448855 1.021276
C  -3.411963 0.159186 -1.205605
C  -5.419035 1.373118 -0.281373
H  1.368014 3.841092 0.782805
H  2.719688 3.083153 1.749113
H  2.255064 1.00484 -1.547961
H  -0.02071 -0.204607 0.432129
H  2.907649 -4.225078 -0.22012
H  0.377127 -4.499502 -0.095983
H  2.642139 5.631817 2.170605
H  4.149331 5.172337 1.329853
H  2.799674 5.929256 0.415397
H  -5.001561 -0.324635 1.821158
H  -3.474029 0.73377 -2.133354
