program: Gaussian 09
title: 000156995
version: EM64L-G09RevD.01
frameworkgroup: C1[X(C21H22O7)]
method: RPBEPBE
basis: SDD
operation: Freq
keyword: #pfreq=noraman
keyword: PBEPBE/SDD
title: #p freq=noraman PBEPBE/SDD
converged: YES YES NO NO
title: Mulliken charges:
elementType: O O O O O O O C C C C C C C C C C C C C C C C C C C C C H H H H H H H H H H H H H H H H H H H H H H
charge: -0.321779 -0.314861 -0.268732 -0.265576 -0.211093 -0.262898 -0.193887 0.377285 0.392977 -0.149036 -0.156674 -0.324214 -0.304970 -0.721336 -0.727642 -0.735830 -0.723718 -0.045132 0.075000 0.211019 0.375259 0.017783 0.050853 -0.371448 -0.261531 -0.167299 -0.332243 0.124100 0.240679 0.231416 0.221040 0.231028 0.210170 0.271136 0.226978 0.232515 0.217463 0.214826 0.229488 0.241011 0.222963 0.235191 0.216888 0.223441 0.214232 0.232635 0.276105 0.321051 0.268453 0.256913
chargesum: 0.00000
title: Mulliken charges with hydrogens summed into heavy atoms:
elementType: O O O O O O O C C C C C C C C C C C C C C C C C C C C C
charge: -0.321779 -0.314861 -0.268732 -0.265576 -0.211093 -0.262898 -0.193887 0.377285 0.392977 0.091644 0.074741 0.127854 0.176336 -0.044381 -0.042317 -0.060788 -0.053410 -0.045132 0.075000 0.211019 0.375259 0.017783 0.050853 -0.095343 0.059521 0.101153 -0.075330 0.124100
polarizability: 3.37153291e+02 -1.34186989e+01 3.20050691e+02 7.97781832e+00 -5.29059546e-02 1.48547384e+02
1716.lowfreq: -2.2245 0.0003 0.0007 0.0009 2.8409 6.1930 14.9886 20.5403 25.5565
frequency: 14.7855 20.2982 25.3819 33.2155 42.2986 50.2975 69.3983 77.9254 85.2885 109.3938 118.0814 124.1266 132.6647 147.1323 169.1584 176.2143 182.5659 190.9312 208.3303 217.2685 227.4194 233.0912 258.6909 269.3810 296.1779 316.3374 329.1976 350.5699 357.8573 368.6357 388.3841 393.2858 396.1533 407.8330 432.4166 454.2580 458.1665 481.6404 499.9313 501.3699 551.6490 564.6791 591.3126 619.9052 624.2263 633.7335 645.0819 664.8208 696.4537 708.0721 719.1077 724.8719 752.4541 776.4548 788.7229 810.2531 825.4071 846.1793 847.8104 868.1942 872.7065 880.2877 889.1844 935.2736 935.9028 940.8238 946.9313 963.1179 977.1225 983.0257 986.2481 1010.2090 1014.2391 1034.9490 1040.7050 1049.0260 1082.5541 1084.7006 1085.8836 1108.5056 1111.5699 1113.2693 1131.3970 1139.1022 1145.6069 1183.2411 1191.3175 1211.8810 1245.4923 1254.9500 1255.7188 1295.6770 1313.7088 1314.7079 1327.8198 1345.6929 1350.7607 1370.6913 1387.0183 1389.7257 1397.3552 1400.1136 1401.5761 1414.6249 1425.0579 1427.5829 1446.0080 1450.8433 1451.4198 1462.2265 1462.7066 1466.0784 1477.5204 1478.8222 1483.7146 1489.5163 1500.7378 1522.9463 1581.2460 1607.1956 1614.6184 1690.4035 2978.3777 2982.4978 2984.9507 2989.2886 2990.6845 3021.6247 3063.7409 3073.0702 3073.7264 3079.7049 3079.8087 3082.9562 3093.4834 3094.1476 3100.4115 3100.8028 3105.3015 3107.5941 3139.6619 3186.7026 3234.7841 3269.9858
redmass: 4.4027 4.6146 4.5912 3.8207 4.1253 4.8607 6.1026 4.4035 4.6592 2.6833 3.4500 1.2494 1.5924 2.1476 4.1845 2.4208 2.3878 1.7201 1.9525 3.7369 2.8134 4.3517 2.5840 5.4791 6.4477 4.2729 4.6517 2.3579 2.5049 7.2420 2.8591 4.5010 3.9079 5.8708 4.2239 3.7723 3.7995 4.8338 4.3245 3.6863 5.9532 4.4565 6.8202 6.2245 6.4332 5.7317 5.9584 7.3893 5.5097 5.6527 3.8980 9.0280 1.6850 3.3647 3.4053 3.7634 7.7777 6.3882 1.6495 4.7970 1.3955 6.4750 6.9940 1.4333 1.4337 6.4423 1.8865 1.6421 2.1879 1.6505 1.3809 4.0617 1.3650 1.4835 1.7192 3.5589 1.5229 1.5353 3.6085 1.8644 1.7867 2.0223 2.3475 2.9744 2.6178 1.1240 1.6556 1.2023 1.8772 2.3862 2.1750 2.0351 1.6804 1.6406 2.4411 1.6892 1.7756 3.0779 1.3167 1.3116 1.3093 2.1300 1.7631 4.0707 2.0373 1.9084 2.5932 1.1517 1.0637 1.0620 1.1577 1.0684 1.0688 1.1308 1.3805 1.1992 1.0854 5.6335 9.4088 8.1486 9.0788 11.0852 1.0614 1.0362 1.0368 1.0366 1.0379 1.0579 1.1003 1.0989 1.0987 1.0988 1.0981 1.0935 1.0914 1.1006 1.1005 1.0985 1.1001 1.0985 1.0921 1.0948 1.0918 1.1085
irintensity: 0.5075 0.1340 1.5738 0.6146 1.0943 1.6729 0.1323 2.5960 4.9846 3.4244 4.5070 0.0628 0.2969 0.2888 0.5229 1.5303 0.2192 0.9492 0.1975 2.9791 2.5587 1.0873 4.7867 6.8636 1.6439 2.1225 5.7517 1.3106 4.8768 0.2869 5.7410 1.5211 6.0434 9.7143 5.9638 15.7796 4.1195 18.0183 2.9686 15.8326 4.8148 6.4594 2.0811 3.3467 17.0666 3.9884 13.9651 1.5663 4.3362 13.9584 11.0163 43.6634 72.9083 21.7061 7.7025 10.9197 19.0021 9.9253 53.4280 21.2501 11.5539 6.4222 24.5776 1.6119 4.6363 109.7385 12.0980 10.7668 30.0625 6.9597 8.5274 314.8157 8.5782 9.1267 52.6656 7.6759 18.6423 2.7554 84.7084 13.5343 25.5112 24.2073 51.6743 15.8211 3.6074 13.4200 93.1141 6.2003 39.7039 8.3945 19.6557 79.4436 52.5346 6.8925 79.8792 3.8582 9.1560 16.8628 29.7170 21.9421 48.5049 163.9713 59.7007 71.1914 7.8564 11.5542 82.1227 17.4407 2.5215 3.6595 7.6597 7.0653 25.8505 18.4179 1.9434 3.5445 14.9880 2.2598 62.4625 17.4452 77.1355 557.9548 33.8368 22.4149 17.9963 18.9679 31.6588 28.8975 6.0399 5.7259 0.3256 47.3596 34.6701 5.3017 11.5547 10.6074 29.6694 28.6490 37.8352 38.9609 24.2773 0.6911 2.6453 0.1447
temp: 298.150 k
press: 1.00000 atm
elementType: 8 8 8 8 8 8 8 6 6 6 6 6 6 6 6 6 6 6 6 6 6 6 6 6 6 6 6 6 1 1 1 1 1 1 1 1 1 1 1 1 1 1 1 1 1 1 1 1 1 1
symmnumber: 1
zpe: 1012407.4 jmol-1
zpe.correction: 0.385606 hartree
zpe.thermalcorrener: 0.413340 hartree
zpe.thermalcorrenthalpy: 0.414284 hartree
zpe.thermalcorrgfe: 0.324952 hartree
zpe.sumelectzpe: -1337.819972 hartree
zpe.sumelectthermal: -1337.792237 hartree
zpe.sumelectthermalent: -1337.791293 hartree
zpe.sumelectthermalfe: -1337.880626 hartree
dipole: -6.5887 -7.1798 2.3439
dipole: 10.0227
quadrupole: -137.5682 -171.5387 -164.9370
quadrupole: -8.8093 -5.1661 1.0270
quadrupole: 20.4465 -13.5241 -6.9224 -8.8093 -5.1661 1.0270
hfenergy: -1338.2055772 hartree
pointgroup: C01 [X(C21H22O7)]
dipole: -2.6846584 2.7785397 -0.7882542 debye
polarizability: 336.0232381|14.1779695|320.6666308|-11.4096577|4.3650061|149.0614972 unknown
InChI: InChI=1S/C21H22O7/c1-20(2)13(27-20)9-24-16-11-5-6-15(22)26-18(11)19(17-12(16)7-8-23-17)25-10-14-21(3,4)28-14/h5-8,13-14H,9-10H2,1-4H3
charge 0 multiplicity 1
50 atoms
O  -5.142779 -0.682083 0.645068
O  6.072414 -0.964652 0.352092
O  -2.707643 1.424563 0.668274
O  2.705848 0.228548 -0.718828
O  1.698343 2.918052 -0.291779
O  0.826152 -1.896288 -0.292648
O  0.423266 -4.167402 -0.277031
C  -6.117954 -0.005346 -0.320276
C  5.907787 0.396196 -0.337136
C  -5.012077 0.792623 0.322799
C  4.906591 -0.70024 -0.574742
C  -3.74957 1.218559 -0.383036
C  3.542032 -0.730074 0.075601
C  -6.03479 -0.493857 -1.759073
C  -7.524366 0.143239 0.239608
C  6.944851 0.66076 -1.416973
C  5.607392 1.562142 0.590981
C  -1.385171 1.086507 0.315281
C  1.388657 0.437478 -0.317806
C  -0.432649 2.108902 0.135803
C  -0.964636 -0.272896 0.204695
C  0.918033 1.756218 -0.16378
C  0.403048 -0.571107 -0.128828
C  -0.472315 3.561194 0.196547
C  -1.856853 -1.392654 0.43464
C  0.805699 4.002139 -0.061407
C  -1.431015 -2.694849 0.295946
C  -0.069926 -3.039432 -0.096372
H  -5.282745 1.439416 1.169431
H  4.971916 -1.237136 -1.531335
H  -3.899757 2.184896 -0.905431
H  -3.408393 0.460778 -1.109715
H  3.592107 -0.385001 1.123941
H  3.091956 -1.735735 0.033139
H  -4.997187 -0.677512 -2.080854
H  -6.591725 -1.442136 -1.863324
H  -6.492272 0.242903 -2.445563
H  -8.085506 0.917108 -0.316956
H  -8.076692 -0.809543 0.151108
H  -7.497717 0.425766 1.305293
H  7.906243 0.967667 -0.966416
H  7.123719 -0.243269 -2.023305
H  6.603586 1.472087 -2.086916
H  4.994438 1.253376 1.452843
H  6.547843 1.992226 0.980605
H  5.059651 2.351415 0.043973
H  -1.339858 4.176696 0.420663
H  -2.891851 -1.193021 0.7338
H  1.263759 4.985612 -0.119502
H  -2.100284 -3.538928 0.4792
