program: Gaussian 09
title: 000156965
version: EM64L-G09RevD.01
frameworkgroup: C1[X(C22H28O3)]
method: RPBEPBE
basis: SDD
operation: Freq
keyword: #pfreq=noraman
keyword: PBEPBE/SDD
title: #p freq=noraman PBEPBE/SDD
converged: YES YES NO NO
title: Mulliken charges:
elementType: O O O C C C C C C C C C C C C C C C C C C C C C C H H H H H H H H H H H H H H H H H H H H H H H H H H H H
charge: -0.264805 -0.256866 -0.309144 -0.132238 -0.479118 -0.076752 -0.047736 -0.717799 -0.715960 0.236535 -0.690597 -0.712581 -0.498311 0.522494 -0.530025 -0.430966 0.346794 -0.203020 -0.375892 0.347345 -0.364433 -0.385520 -0.204505 -0.193894 -0.252544 0.235079 0.191250 0.243090 0.206534 0.193788 0.241527 0.233191 0.202423 0.221158 0.218424 0.210748 0.223996 0.222962 0.205267 0.209871 0.214517 0.208827 0.222176 0.242210 0.295308 0.237335 0.228334 0.270698 0.266002 0.257706 0.227791 0.229470 0.229860
chargesum: 0.00000
title: Mulliken charges with hydrogens summed into heavy atoms:
elementType: O O O C C C C C C C C C C C C C C C C C C C C C C
charge: -0.264805 -0.256866 -0.309144 0.102840 -0.044778 0.129782 0.146052 -0.040659 -0.065630 0.236535 -0.038371 -0.079367 -0.033926 0.522494 -0.234717 -0.193632 0.346794 0.025314 -0.105194 0.347345 -0.098431 -0.127814 0.023286 0.035576 -0.022684
polarizability: 3.28228286e+02 2.44282573e+01 2.37787315e+02 3.65692914e+00 -1.56720140e+01 1.83002466e+02
1716.lowfreq: -20.3494 -15.8643 -5.1233 -1.8830 -0.0007 -0.0004 0.0005 7.6709 15.9079
frequency: -19.3598 -8.0949 15.7573 18.1610 33.4366 41.1882 50.9074 65.5154 88.0737 88.7553 124.7771 133.9385 169.9350 183.2298 201.7823 205.7921 216.1268 219.0961 226.8875 233.1137 245.8857 247.0345 279.5893 292.3689 332.4054 352.6929 358.4769 370.3261 386.8343 408.7472 411.0198 443.6202 449.2406 480.8661 489.1990 518.9629 544.5786 566.9588 590.0208 613.5726 640.0354 648.1708 690.6237 700.9447 713.9807 730.2143 764.1171 780.8153 787.7586 794.7716 811.7321 815.3882 835.3156 864.7267 899.7823 903.0775 912.2016 919.1471 921.0166 928.4702 938.0752 950.8308 952.6287 961.6513 966.6959 966.9283 977.7931 986.3223 986.4390 987.7658 997.3273 1019.9428 1021.0308 1077.6331 1079.7333 1088.6046 1095.6650 1101.4485 1128.1462 1134.6365 1149.2030 1167.1985 1172.4967 1180.6543 1182.5589 1192.3305 1200.9951 1232.3619 1235.4999 1247.8300 1249.8790 1278.0581 1301.2382 1310.0604 1311.3782 1323.1707 1330.9197 1343.2206 1356.8236 1374.3622 1377.1442 1380.2636 1384.3922 1390.4971 1395.0346 1401.2767 1437.9978 1446.1337 1460.1523 1461.7072 1462.9130 1465.5835 1469.6372 1472.3245 1474.4140 1476.5576 1480.1536 1482.4792 1488.5410 1491.7214 1587.9896 1595.9072 1603.2518 1621.0513 1625.1619 2953.9728 2962.1058 2966.4047 2972.7965 2974.7363 2977.7603 2983.4156 3022.0928 3033.9787 3041.6757 3058.3992 3063.6442 3067.4602 3068.1813 3072.8740 3075.2391 3075.7565 3085.4213 3109.9402 3129.5942 3130.1735 3139.4108 3148.1644 3156.0439 3161.8385 3164.5830 3167.8440 3174.2422
redmass: 2.8263 3.8657 4.6224 5.3729 4.7255 4.3797 3.7394 3.1687 4.5031 3.0578 3.8732 4.4841 3.6334 5.1206 1.2356 1.2586 2.0530 2.2724 2.9890 1.6916 3.1913 1.0911 4.3847 4.2148 4.5034 2.3784 2.2335 3.8693 1.9696 2.7341 2.9250 3.0003 2.9032 3.3113 3.3513 4.5181 2.7425 7.3502 5.5950 6.5226 5.4143 4.6664 2.4085 2.2470 4.0954 3.7101 1.8294 2.3332 3.0109 3.0301 2.6645 2.9782 1.2526 3.4615 1.4009 1.4001 1.4540 1.1916 1.5384 1.4885 2.5168 1.9416 1.7014 1.8905 1.7745 1.3743 1.3317 1.6859 3.0051 5.9161 1.9802 2.0617 2.0469 1.5127 3.3493 1.6531 1.6090 1.8633 1.8867 1.8890 2.1736 1.1374 1.1500 1.1114 2.1187 1.9590 2.7154 1.2112 1.2340 1.4825 2.3343 1.3633 1.3181 1.3157 1.5012 1.4913 1.4486 1.2515 1.3642 1.4659 1.2275 7.5688 1.2125 8.6935 1.2260 1.2147 2.5670 2.4981 1.0742 1.1562 1.0514 1.0483 1.0570 2.2800 2.3616 1.0558 1.0493 1.0550 1.0493 1.0539 6.1781 6.6388 6.3606 6.7869 8.3322 1.0792 1.0836 1.0360 1.0397 1.0356 1.0620 1.0366 1.0857 1.0585 1.0974 1.0994 1.0996 1.0985 1.0997 1.0995 1.0995 1.0991 1.0994 1.1070 1.0869 1.0850 1.0891 1.0928 1.0930 1.0931 1.0964 1.0978 1.1004
irintensity: 0.0001 0.0519 0.8084 0.4785 0.5171 0.7613 0.4584 0.3938 0.1472 0.8515 0.6621 0.2973 0.6869 3.2066 0.3147 0.5251 0.0577 2.4855 0.2563 0.1444 3.0400 0.0233 6.1208 6.6911 2.1649 1.0605 0.2276 4.0146 0.7488 3.9657 0.2038 7.2354 2.2808 12.7044 7.9447 1.5334 8.0260 0.8034 5.4275 3.4237 3.8763 4.3793 33.9937 17.2451 2.6723 41.7765 72.2269 28.2525 6.7991 9.2937 48.9647 1.2535 1.2578 50.6038 8.2773 18.7092 3.3554 2.1273 27.4847 1.0842 19.5296 18.7671 2.5668 13.1156 1.4892 0.1217 0.1610 0.2898 0.7253 0.1006 8.3155 18.2109 24.0678 20.6258 262.9502 5.7561 4.1023 45.5540 17.6950 10.8296 25.8729 25.1558 37.2597 0.4340 21.9541 3.6225 181.0790 10.5632 8.3638 162.1696 155.0843 15.2947 1.3147 0.7033 5.4346 2.8047 1.6236 11.7881 8.8108 14.7416 27.1383 0.5532 22.0684 1.4582 21.6222 22.1343 44.5635 70.3683 5.3037 14.4064 3.5877 8.2967 3.2565 137.9400 33.0649 6.0007 16.6876 21.3273 17.1695 9.3828 96.1694 13.0781 100.2426 11.1857 83.3507 20.3647 19.8609 32.0831 50.1179 29.8697 31.5798 35.9049 4.5386 30.5087 19.0912 17.6308 30.6493 90.3472 24.8914 30.6321 37.5070 65.2781 41.4913 7.4939 3.5738 3.2633 11.3962 24.3648 28.7376 0.6293 11.5997 10.9834 8.4974
temp: 298.150 k
press: 1.00000 atm
elementType: 8 8 8 6 6 6 6 6 6 6 6 6 6 6 6 6 6 6 6 6 6 6 6 6 6 1 1 1 1 1 1 1 1 1 1 1 1 1 1 1 1 1 1 1 1 1 1 1 1 1 1 1 1
symmnumber: 1
zpe: 1167499.9 jmol-1
zpe.correction: 0.444677 hartree
zpe.thermalcorrener: 0.468827 hartree
zpe.thermalcorrenthalpy: 0.469771 hartree
zpe.thermalcorrgfe: 0.389139 hartree
zpe.sumelectzpe: -1078.940198 hartree
zpe.sumelectthermal: -1078.916049 hartree
zpe.sumelectthermalent: -1078.915104 hartree
zpe.sumelectthermalfe: -1078.995737 hartree
dipole: 0.5299 -1.1034 1.8150
dipole: 2.1892
quadrupole: -129.1416 -138.3621 -156.0204
quadrupole: -1.0826 0.3944 -0.7430
quadrupole: 12.0331 2.8126 -14.8457 -1.0826 0.3944 -0.7430
hfenergy: -1079.3848754 hartree
pointgroup: C01 [X(C22H28O3)]
dipole: 0.2884708 -0.4193224 0.6948197 debye
polarizability: 325.6897909|26.5440864|239.6654127|-8.5620998|-18.3952969|183.6628636 unknown
InChI: InChI=1S/C22H28O3/c1-16(2)13-21(17(3)4)22(23)24-15-18-9-8-12-20(14-18)25-19-10-6-5-7-11-19/h5-12,14,16-17,21H,13,15H2,1-4H3
charge 0 multiplicity 1
53 atoms
O  -2.507629 -1.577307 0.392431
O  -2.513856 -0.286898 -1.552229
O  2.44317 0.562132 -0.666901
C  -4.092337 0.240771 0.291225
C  -3.920371 1.777816 0.126466
C  -5.493695 -0.250503 -0.24259
C  -2.95299 2.471912 1.129576
C  -5.731771 0.076991 -1.735443
C  -5.725639 -1.754331 0.035973
C  -2.970162 -0.518972 -0.406435
C  -1.501296 1.943521 1.037592
C  -3.472837 2.4078 2.587146
C  -1.432157 -2.451813 -0.203714
C  -0.056854 -2.013163 0.248474
C  0.613318 -0.966354 -0.430017
C  0.571925 -2.646797 1.350153
C  1.890012 -0.556453 0.004686
C  1.851774 -2.225283 1.774867
C  2.52139 -1.175113 1.110281
C  3.843444 0.686918 -0.856952
C  4.687211 -0.420989 -1.106698
C  4.34574 2.00662 -0.886226
C  6.055326 -0.192508 -1.375241
C  5.714401 2.218772 -1.160354
C  6.576194 1.122483 -1.401382
H  -4.052253 -0.034075 1.361329
H  -4.920336 2.245178 0.238154
H  -3.582546 1.984784 -0.906956
H  -6.233786 0.322276 0.355885
H  -2.935414 3.543099 0.833977
H  -4.991016 -0.431302 -2.378022
H  -5.660019 1.16044 -1.936501
H  -6.741032 -0.257053 -2.040205
H  -5.053278 -2.385715 -0.574032
H  -5.544644 -2.003911 1.097597
H  -6.765932 -2.035196 -0.212453
H  -1.429264 0.893122 1.377052
H  -1.11763 1.990511 0.002132
H  -0.827285 2.541935 1.678602
H  -4.5061 2.79644 2.665114
H  -2.831422 3.010275 3.257093
H  -3.467425 1.371494 2.975223
H  -1.683685 -3.454688 0.175186
H  -1.534627 -2.409784 -1.301957
H  0.144023 -0.460557 -1.279713
H  0.057726 -3.458913 1.876839
H  2.331791 -2.709265 2.632384
H  3.505338 -0.836787 1.44919
H  4.282489 -1.437832 -1.105766
H  3.660415 2.838803 -0.699592
H  6.711822 -1.047036 -1.573773
H  6.106773 3.241383 -1.183554
H  7.637506 1.290919 -1.612019
