program: Gaussian 09
title: 000156931
version: EM64L-G09RevD.01
frameworkgroup: C1[X(C7H8O3)]
method: RPBEPBE
basis: SDD
operation: Freq
keyword: #p
keyword: freq=noraman
keyword: PBEPBE/SDD
title: #p freq=noraman PBEPBE/SDD
converged: NO YES NO NO
title: Mulliken charges:
elementType: O O O C C C C C C C H H H H H H H H
charge: -0.416534 -0.416535 -0.395880 0.441644 -0.281731 0.219572 -0.420899 -0.389349 -0.253669 -0.204484 0.199620 0.220988 0.213330 0.228372 0.226711 0.340223 0.340223 0.348397
chargesum: 0.00000
title: Mulliken charges with hydrogens summed into heavy atoms:
elementType: O O O C C C C C C C
charge: -0.076311 -0.076312 -0.047482 0.441644 -0.082111 0.219572 -0.199910 -0.176019 -0.025296 0.022226
polarizability: 1.11957344e+02 -1.07726866e+00 9.40217118e+01 -6.25017172e-03 -7.29518567e-03 4.64819334e+01
1716.lowfreq: -150.5590 -12.7870 -0.0012 -0.0010 -0.0010 3.1312 14.3569 66.9352 111.3100
frequency: -150.5543 66.8512 111.2985 181.2386 210.5551 309.2198 318.6199 326.1755 351.4717 407.4411 486.4400 495.7211 563.0949 569.1948 635.6093 729.2332 740.1216 751.5947 838.9380 844.3876 921.3452 940.8339 955.4609 969.6611 1045.9626 1076.1237 1138.4710 1156.9024 1162.6159 1173.0334 1228.0085 1253.0316 1309.4427 1319.2322 1396.1160 1417.5817 1455.2792 1502.6308 1609.5284 1619.0215 2917.6158 3108.6274 3119.7353 3142.1455 3167.4551 3527.3656 3530.4549 3556.0173
redmass: 1.1010 6.6489 4.6761 4.6387 5.3853 1.1579 7.8783 1.1819 3.1607 3.4387 3.3474 7.3406 7.3187 3.7870 6.0711 4.1122 3.4749 1.3276 1.4720 4.8225 2.4370 2.3767 7.4756 1.3233 2.2700 2.2757 1.0801 1.2589 1.3765 1.0827 1.4718 2.5094 1.3931 1.1067 6.4581 1.9456 2.0695 2.8134 6.4166 6.7086 1.0845 1.0884 1.0888 1.0918 1.1000 1.0667 1.0660 1.0659
irintensity: 87.7606 0.2387 16.3858 21.8159 7.4053 143.8982 6.9532 90.6505 29.3589 42.4205 1.4656 19.8191 0.0501 5.5918 32.2717 10.4051 23.1421 117.3098 3.5670 54.6960 137.9702 73.8674 83.4437 1.0503 1.2733 114.2699 100.9497 39.1285 29.1518 0.0803 11.0112 31.0167 53.2365 4.8933 15.5589 26.8308 47.1303 19.3247 28.8105 34.5579 75.9078 17.1265 8.4228 21.4073 22.2687 7.7670 4.5365 26.5828
temp: 298.150 k
press: 1.00000 atm
elementType: 8 8 8 6 6 6 6 6 6 6 1 1 1 1 1 1 1 1
symmnumber: 1
zpe: 356827.5 jmol-1
zpe.correction: 0.135908 hartree
zpe.thermalcorrener: 0.145035 hartree
zpe.thermalcorrenthalpy: 0.145979 hartree
zpe.thermalcorrgfe: 0.101787 hartree
zpe.sumelectzpe: -496.437032 hartree
zpe.sumelectthermal: -496.427906 hartree
zpe.sumelectthermalent: -496.426962 hartree
zpe.sumelectthermalfe: -496.471154 hartree
dipole: -0.5196 -1.0706 0.0003
dipole: 1.1900
quadrupole: -41.3357 -46.4607 -65.5899
quadrupole: 9.4742 -0.0038 -0.0040
quadrupole: 9.7930 4.6681 -14.4611 9.4742 -0.0038 -0.0040
hfenergy: -496.5729405 hartree
pointgroup: C01[X(C7H8O3)]
dipole: 0.1822168 0.4312701 0.000118 debye
dipolederiv: -0.4926927 0.1647957 -0.2458494 0.2277787 -0.4039279 0.0353029 -0.2401351 -0.0521227 -0.9209985 -0.4927183 0.1646959 0.2459977 0.2276882 -0.4040134 -0.0351293 0.2402959 0.0522554 -0.9208857 -0.5008789 0.6543376 0.0000794 0.6121252 -0.8673252 -0.0000181 0.0000737 -0.000019 -0.3718351 -0.1954966 -0.0649723 -0.0000157 0.1884309 -0.2421357 -0.0000036 0.0000335 -0.0000272 -0.1140162 1.1868055 0.0497833 -0.0000041 -0.0554217 0.5850828 -0.000074 -0.0000234 -0.0000505 1.30821 0.5249705 -0.6384334 -0.0000535 -0.5379332 0.8586449 0.0000552 -0.0000369 0.0000528 0.1147632 0.1951647 0.0614302 0.0000378 -0.096549 0.1013024 0.0000279 0.0000128 0.0000415 -0.1481235 -0.2588675 0.3517744 0.000047 -0.0072426 -0.0416267 0.0000288 -0.0000078 0.000059 -0.210318 -0.177964 -0.1287739 -0.0000204 -0.1568957 -0.1182462 -0.0000008 -0.0000234 0.0000015 -0.195977 0.1046197 -0.0576429 0.0000121 0.0976578 0.1930675 0.000057 0.0000375 0.0000433 -0.1314766 -0.0183336 0.0000694 0.0000014 0.012836 -0.2470815 -0.0000245 0.0000007 -0.0000284 -0.0612987 0.0625548 -0.0961341 -0.0000196 -0.0675266 -0.0934171 -0.0000399 -0.0000159 -0.0000428 0.1448558 0.0615519 -0.0136367 -0.0000118 -0.0491278 -0.1392264 -0.0000518 -0.0000185 -0.0000474 0.1696968 -0.0182085 0.0967128 -0.0000008 0.1086723 -0.0312404 -0.0000225 0.0000008 -0.0000231 0.175602 -0.122195 -0.0421151 -0.0000303 -0.0517972 0.0796265 -0.0000166 -0.0000317 -0.0000159 0.1576133 -0.014733 -0.1415756 -0.0213434 -0.1536763 0.2706724 0.0561287 0.0485357 0.0637372 0.3189291 -0.0147765 -0.1415332 0.0212215 -0.1536167 0.2707575 -0.0561883 -0.0486616 -0.0637767 0.3188976 0.1711974 -0.218782 -0.0000478 -0.1454024 0.2290865 -0.0000312 -0.0000364 -0.000037 0.3663618 unknown
polarizability: 112.0207625|-0.1379348|93.9582928|0.0058615|0.007611|46.4819334 unknown
InChI: InChI=1S/C7H8O3/c8-6-4-2-1-3-5(6)7(9)10/h1-4,7-10H
charge 0 multiplicity 1
18 atoms
O  2.287965 0.276414 1.222912
O  2.288167 0.276674 -1.222322
O  0.713695 -1.948149 -0.000165
C  0.21596 0.42775 0.000129
C  1.678827 0.804808 0.000301
C  -0.237059 -0.921537 -0.000102
C  -0.753188 1.455954 0.000203
C  -1.62525 -1.2077 -0.00027
C  -2.139132 1.181508 0.000053
C  -2.57235 -0.162359 -0.000189
H  1.775496 1.915451 0.000431
H  -0.409975 2.498332 0.000383
H  -1.961968 -2.253318 -0.000462
H  -2.864407 2.001068 0.00012
H  -3.641586 -0.401084 -0.000317
H  3.206091 0.640419 1.32603
H  3.206386 0.640536 -1.325109
H  0.261927 -2.829967 -0.000327
