program: Gaussian 09
title: 000156901
version: EM64L-G09RevD.01
frameworkgroup: C1[X(C10H18N4O2S)]
method: RPBEPBE
basis: SDD
operation: Freq
keyword: #p
keyword: freq=noraman
keyword: PBEPBE/SDD
title: #p freq=noraman PBEPBE/SDD
converged: YES YES NO NO
title: Mulliken charges:
elementType: S O O N N N N C C C C C C C C C C H H H H H H H H H H H H H H H H H H
charge: 0.292136 -0.249301 -0.217539 -0.234877 -0.180333 0.058253 -0.489124 0.318364 -0.387474 -0.714598 -0.706054 -0.706851 0.252240 0.068716 -0.214391 -0.565273 -0.666688 0.239470 0.249896 0.216287 0.217181 0.213475 0.205223 0.235179 0.212241 0.205661 0.230304 0.209267 0.323779 0.323355 0.283567 0.288369 0.229403 0.228629 0.231507
chargesum: 0.00000
title: Mulliken charges with hydrogens summed into heavy atoms:
elementType: S O O N N N N C C C C C C C C C C
charge: 0.292136 -0.249301 -0.217539 -0.234877 -0.180333 0.058253 0.158010 0.318364 0.101892 -0.067655 -0.053412 -0.061618 0.252240 0.068716 -0.214391 0.006664 0.022851
polarizability: 2.27723113e+02 -2.73530886e+00 1.69854697e+02 1.25734597e+01 5.75409017e+00 1.08161826e+02
1716.lowfreq: -6.7059 -0.0018 -0.0013 0.0015 5.9094 8.3964 27.3747 37.2720 47.5538
frequency: 27.2733 37.1780 47.5260 63.1285 90.4386 100.8334 118.1255 151.7187 161.5463 196.5512 200.8574 226.5747 232.3694 237.9615 242.2821 248.9440 268.0782 269.1288 280.0889 311.8858 336.5308 360.9447 371.5332 398.7264 416.2181 432.3510 468.1273 517.4652 562.9846 603.7048 613.1487 677.9726 681.8095 702.9960 724.8565 755.2183 762.9302 772.7352 853.6492 887.9483 898.3455 929.6541 933.4407 944.7286 983.7678 994.4936 1022.1734 1032.1900 1046.5490 1050.2759 1069.7641 1085.3238 1191.8618 1215.7526 1232.9810 1241.3562 1254.4787 1274.6550 1276.2831 1278.3609 1329.4777 1352.4092 1363.5772 1375.3827 1381.5314 1400.1776 1407.0878 1438.7350 1443.7633 1452.8655 1463.8088 1464.5799 1473.6011 1478.9755 1481.9293 1485.6424 1495.7287 1528.4540 1609.5724 1653.0617 1672.2766 2969.1158 2974.6284 2979.7911 2988.1098 3023.1915 3054.2217 3062.6234 3065.6486 3068.3985 3074.7889 3083.2889 3083.5044 3085.2058 3089.6439 3092.7426 3134.6110 3410.5203 3533.3563
redmass: 3.6942 2.9429 2.9727 3.4878 4.3327 2.9395 4.1575 6.9737 8.4609 1.0504 1.1169 2.1248 2.6294 1.1961 4.6000 3.3074 1.4108 1.1913 3.1947 5.3916 3.4071 2.6211 2.4198 6.7773 2.1758 2.9151 6.3615 5.5143 10.3534 4.8876 10.0929 5.1541 5.7817 10.6783 4.9545 4.7311 2.1010 1.1234 3.0234 3.3052 2.6365 1.5955 1.6413 1.2166 3.1786 1.7622 1.9290 1.6388 1.2265 5.6144 2.3904 2.3010 5.1606 2.6922 1.2218 3.4718 3.0647 1.6927 1.2715 2.4644 4.0958 1.5975 1.3322 1.1979 1.2011 1.2059 1.2106 1.0915 1.0855 1.0528 1.0521 1.0526 1.0390 1.0580 1.0488 1.0607 1.0656 10.6539 10.6686 10.0152 1.1047 1.0350 1.0354 1.0362 1.0357 1.0579 1.0604 1.1002 1.0994 1.0995 1.0983 1.0971 1.1006 1.1007 1.1000 1.1043 1.1082 1.0429 1.1004
irintensity: 0.5383 0.4175 0.0770 0.9690 1.3015 7.5758 2.2324 12.8417 0.6456 0.1077 41.6967 2.2559 2.5760 0.2115 0.8209 2.9346 0.0856 0.0141 1.3753 3.7286 20.1034 5.7106 1.3170 2.7648 3.5285 13.5910 2.2637 7.8515 4.3242 5.2361 1.6113 30.3531 2.1883 1.1727 7.3500 27.2079 72.5096 10.3877 44.0496 33.3229 7.8425 2.0687 4.9090 0.0352 30.9439 19.5430 10.2823 11.8069 0.3789 9.8382 4.8338 13.2634 152.8347 16.5206 0.4395 85.0242 59.8329 5.4524 30.0688 215.8805 134.2373 41.0244 36.6467 20.5927 28.1443 18.4257 12.0384 35.2375 6.3819 9.9937 9.3116 19.8846 16.0315 25.9972 10.2530 7.1366 35.6199 548.0599 597.1383 130.9394 79.8342 40.8735 18.8021 23.5105 31.8197 16.9355 2.1352 7.7418 21.0825 51.2405 84.7368 19.4512 19.8166 17.7513 34.3063 8.4804 16.6561 10.1752 13.1580
temp: 298.150 k
press: 1.00000 atm
elementType: 16 8 8 7 7 7 7 6 6 6 6 6 6 6 6 6 6 1 1 1 1 1 1 1 1 1 1 1 1 1 1 1 1 1 1
symmnumber: 1
zpe: 741067.5 jmol-1
zpe.correction: 0.282258 hartree
zpe.thermalcorrener: 0.301794 hartree
zpe.thermalcorrenthalpy: 0.302738 hartree
zpe.thermalcorrgfe: 0.234088 hartree
zpe.sumelectzpe: -1158.054027 hartree
zpe.sumelectthermal: -1158.034491 hartree
zpe.sumelectthermalent: -1158.033547 hartree
zpe.sumelectthermalfe: -1158.102196 hartree
dipole: 1.4573 2.2752 1.0650
dipole: 2.9042
quadrupole: -98.0576 -115.5344 -108.7058
quadrupole: -0.6045 -0.5960 -3.9023
quadrupole: 9.3750 -8.1018 -1.2732 -0.6045 -0.5960 -3.9023
hfenergy: -1158.3362846 hartree
pointgroup: C01 [X(C10H18N4O2S1)]
dipole: 0.5850008 -0.9080819 -0.3724522 debye
polarizability: 226.9149495|3.2040918|170.460985|-15.6729588|1.2108928|108.3637019 unknown
InChI: InChI=1S/C10H18N4O2S/c1-5-17-8-12-7(15)13(6-10(2,3)4)9(16)14(8)11/h5-6,11H2,1-4H3
charge 0 multiplicity 1
35 atoms
S  3.614889 -0.468165 -0.550386
O  -0.957591 -2.37878 0.426731
O  -0.466671 2.285866 0.71284
N  -0.807169 -0.018498 0.403505
N  1.118721 -1.377141 0.031892
N  1.382426 0.993866 0.081595
N  1.74613 -2.637505 -0.122405
C  -3.171155 0.310224 -0.582216
C  -2.26458 0.135169 0.678896
C  -4.621512 0.451265 -0.043254
C  -2.789155 1.584785 -1.377837
C  -3.085632 -0.927279 -1.512479
C  -0.292705 -1.317747 0.301085
C  0.028484 1.172126 0.418325
C  1.880031 -0.211558 -0.10832
C  4.152458 1.364321 -0.608889
C  5.648818 1.414191 -0.941249
H  -2.581035 -0.764459 1.235279
H  -2.360408 1.024407 1.325293
H  -5.328885 0.583067 -0.882401
H  -4.720036 1.329191 0.622692
H  -4.931314 -0.448388 0.521692
H  -3.497213 1.730266 -2.215266
H  -2.808234 2.483569 -0.737305
H  -1.774074 1.505142 -1.808154
H  -2.076337 -1.032606 -1.951893
H  -3.315322 -1.860907 -0.969368
H  -3.802449 -0.818122 -2.347784
H  1.305201 -3.171665 -0.883232
H  1.735124 -3.161623 0.76311
H  3.527826 1.859497 -1.367682
H  3.91336 1.799626 0.372924
H  6.256206 0.899467 -0.175742
H  5.867714 0.958694 -1.923418
H  5.976391 2.469203 -0.978777
