program: Gaussian 09
title: 000156868
version: EM64L-G09RevD.01
frameworkgroup: C1[X(C11H17N3O)]
method: RPBEPBE
basis: SDD
operation: Freq
keyword: #p
keyword: freq=noraman
keyword: PBEPBE/SDD
title: #p freq=noraman PBEPBE/SDD
converged: YES YES NO NO
title: Mulliken charges:
elementType: O N N N C C C C C C C C C C C H H H H H H H H H H H H H H H H H
charge: -0.291046 -0.281480 -0.389128 -0.689249 -0.350049 -0.384011 -0.324173 0.279237 0.160187 -0.688424 -0.348902 -0.334202 0.502954 -0.414211 -0.430404 0.250630 0.171411 0.196054 0.266836 0.235840 0.217619 0.176028 0.293722 0.199336 0.234439 0.211366 0.271256 0.205369 0.219530 0.216824 0.307373 0.309269
chargesum: 0.00000
title: Mulliken charges with hydrogens summed into heavy atoms:
elementType: O N N N C C C C C C C C C C C
charge: -0.291046 -0.045639 -0.095405 -0.072607 0.071991 0.078879 0.069474 0.279237 0.160187 -0.043283 -0.077646 -0.128833 0.502954 -0.194682 -0.213579
polarizability: 2.36593779e+02 -1.81373123e-01 1.35757934e+02 -1.97623189e+01 5.51053410e-01 8.85210774e+01
1716.lowfreq: -0.0002 0.0002 0.0006 1.9917 3.3754 10.4024 20.8366 29.0028 36.2345
frequency: 20.6037 28.9755 36.1150 52.9032 79.5337 107.2938 128.1945 136.8554 161.5290 248.0874 253.9903 276.1051 303.2072 346.5667 364.4078 386.3344 390.5000 394.8401 410.1447 460.6419 488.0375 517.3280 535.3641 608.7380 635.2510 664.9752 686.1678 748.8735 756.0199 807.8222 811.0840 819.0898 841.4462 849.0828 896.7577 936.5743 983.3257 990.1507 1009.8277 1019.5978 1030.5462 1054.2649 1072.9650 1114.7390 1130.2311 1147.8637 1155.8965 1167.1649 1192.2079 1224.1233 1264.1131 1277.0224 1296.8653 1307.0027 1310.3925 1323.3949 1352.9786 1382.6918 1384.3895 1390.7622 1437.1416 1445.0995 1451.1402 1472.2922 1478.6903 1483.2963 1487.8566 1499.5527 1523.6345 1560.8030 1597.0105 1631.3240 1644.9764 2844.6378 2854.6533 2977.3433 2992.3934 3006.0116 3039.5478 3069.7161 3092.0991 3093.1049 3109.2376 3122.1597 3135.0007 3159.6219 3418.7848 3563.8310 3567.4600 3703.9108
redmass: 3.9179 4.6243 2.0198 3.9444 3.0878 3.3853 2.8498 3.7940 3.0210 1.4624 2.1424 4.8824 3.5805 3.5237 3.7714 1.3645 2.7613 1.0425 2.8663 3.8635 1.8526 1.5938 3.4918 4.5857 6.7400 1.4104 3.6027 1.7824 4.4148 1.1698 1.4086 2.6781 1.7237 2.3430 1.8039 1.3995 1.3649 3.7060 2.4815 1.5027 3.5830 2.6704 1.7698 1.9839 1.2177 2.2977 3.3424 1.9185 1.1709 1.4247 1.2693 1.9090 1.1187 1.2981 1.4038 2.5419 1.3096 1.3008 4.5012 1.3283 2.4577 1.4426 1.1536 1.0694 1.0805 1.6090 1.1621 1.0868 3.0061 6.5947 6.8173 2.9799 1.4775 1.0718 1.0718 1.0375 1.0664 1.0865 1.0863 1.0977 1.0984 1.1002 1.0864 1.0893 1.0961 1.0950 1.0739 1.0452 1.0769 1.1040
irintensity: 1.6267 1.3620 1.7094 4.8580 0.4039 2.4084 2.0093 4.4640 1.1575 0.0888 3.7724 2.9771 11.4796 10.7160 6.3034 260.3106 37.5622 10.6337 1.9358 6.4320 34.6163 89.9862 16.8810 2.8363 1.2653 108.6531 13.1825 2.9407 16.4568 3.0177 16.6911 3.1842 49.0312 9.4680 4.1290 0.2453 1.5972 5.1456 3.6758 0.2997 1.5746 11.2926 25.2910 9.3739 31.7246 2.6379 86.3542 20.8303 90.7333 4.3019 13.3339 186.9850 49.4260 2.6113 39.0204 65.1427 10.2115 5.0091 1.4813 21.2155 29.8996 26.5542 16.1351 24.1131 40.4001 305.9831 47.6602 4.4162 25.5857 50.7371 133.5435 74.5634 347.9842 51.7898 198.1960 35.5342 54.1052 22.7619 19.3803 57.1158 7.4472 39.5309 19.7889 23.6233 23.4581 5.6636 3.1798 98.8954 8.4446 22.1152
temp: 298.150 k
press: 1.00000 atm
elementType: 8 7 7 7 6 6 6 6 6 6 6 6 6 6 6 1 1 1 1 1 1 1 1 1 1 1 1 1 1 1 1 1
symmnumber: 1
zpe: 707198.1 jmol-1
zpe.correction: 0.269358 hartree
zpe.thermalcorrener: 0.285557 hartree
zpe.thermalcorrenthalpy: 0.286501 hartree
zpe.thermalcorrgfe: 0.223399 hartree
zpe.sumelectzpe: -667.715098 hartree
zpe.sumelectthermal: -667.698899 hartree
zpe.sumelectthermalent: -667.697955 hartree
zpe.sumelectthermalfe: -667.761057 hartree
dipole: 3.4753 -4.0490 -2.8703
dipole: 6.0590
quadrupole: -53.6534 -83.6346 -97.2209
quadrupole: 3.6474 -2.0207 -3.8104
quadrupole: 24.5162 -5.4650 -19.0512 3.6474 -2.0207 -3.8104
hfenergy: -667.9844557 hartree
pointgroup: C01 [X(C11H17N3O1)]
dipole: -1.3667785 1.8077246 -0.7392224 debye
polarizability: 236.7555717|-4.7687627|133.6724973|18.5384825|9.7459733|90.4447214 unknown
InChI: InChI=1S/C11H17N3O/c1-2-13-7-8-14-11(15)9-3-5-10(12)6-4-9/h3-6,13-14H,2,7-8,12H2,1H3
charge 0 multiplicity 1
32 atoms
O  0.387267 -1.572011 0.616354
N  4.473186 0.337674 0.014607
N  0.744563 0.723338 0.601178
N  -5.664112 0.336535 -0.708457
C  3.0453 0.376577 -0.353723
C  2.17621 0.591427 0.908857
C  5.389065 -0.127316 -1.050412
C  -1.526746 -0.137497 0.185652
C  -0.078678 -0.392473 0.48232
C  6.845752 -0.133534 -0.555242
C  -2.308874 -1.232688 -0.268849
C  -2.172049 1.117453 0.354302
C  -4.311973 0.180879 -0.412386
C  -3.670947 -1.085053 -0.568848
C  -3.537934 1.280816 0.06322
H  2.770117 -0.598571 -0.795446
H  2.799686 1.162229 -1.11421
H  2.50696 1.499938 1.450255
H  2.309721 -0.277115 1.574122
H  4.790945 1.23272 0.414615
H  5.087268 -1.156017 -1.328148
H  5.316176 0.488711 -1.983224
H  0.38028 1.642315 0.351218
H  7.18067 0.886668 -0.283996
H  6.942368 -0.774742 0.338198
H  7.525909 -0.512424 -1.339347
H  -1.812023 -2.203158 -0.372281
H  -1.625506 1.980448 0.755102
H  -4.251402 -1.945679 -0.923398
H  -4.017171 2.255965 0.213601
H  -6.124615 1.234501 -0.592869
H  -6.219113 -0.450018 -1.032866
