program: Gaussian 09
title: 000156866
version: EM64L-G09RevD.01
frameworkgroup: C1[X(C20H21NO5)]
method: RPBEPBE
basis: SDD
operation: Freq
keyword: #p
keyword: freq=noraman
keyword: PBEPBE/SDD
title: #p freq=noraman PBEPBE/SDD
converged: YES YES NO NO
title: Mulliken charges:
elementType: O O O O O N C C C C C C C C C C C C C C C C C C C C H H H H H H H H H H H H H H H H H H H H H
charge: -0.289204 -0.238931 -0.292407 -0.364977 -0.195714 -0.425190 -0.173965 -0.609527 0.483228 0.226355 0.149463 -0.399554 -0.393416 0.073235 -0.231722 -0.246707 0.312678 -0.258988 -0.317830 -0.260695 -0.318632 -0.243234 -0.216873 -0.661535 0.270717 -0.769297 0.299940 0.266434 0.248746 0.411380 0.245145 0.247206 0.228072 0.237996 0.232907 0.284945 0.243686 0.222042 0.265167 0.236231 0.235366 0.221003 0.230346 0.251219 0.251453 0.247718 0.285718
chargesum: 0.00000
title: Mulliken charges with hydrogens summed into heavy atoms:
elementType: O O O O O N C C C C C C C C C C C C C C C C C C C C
charge: -0.289204 -0.238931 -0.292407 -0.364977 -0.195714 -0.013810 0.125975 -0.094346 0.483228 0.226355 0.149463 -0.154409 -0.146210 0.073235 -0.003650 -0.008711 0.312678 -0.026081 -0.032885 0.205033 -0.053465 -0.007003 0.018493 0.041032 0.270717 0.015593
polarizability: 2.92687339e+02 4.67579890e+00 2.33154529e+02 1.81804170e+01 2.56697180e+01 1.70221528e+02
1716.lowfreq: -8.6186 -6.2910 -0.0010 -0.0009 -0.0006 5.1531 15.6722 24.9967 29.7310
frequency: 15.3858 24.9780 29.5950 40.8061 43.2224 53.0674 62.1870 67.0012 78.7449 82.4103 85.2102 97.6384 102.1659 126.1280 146.1038 161.6138 193.9457 213.0739 236.6125 265.9682 276.2544 288.7719 312.9738 332.0724 351.9829 371.2330 403.7420 405.5481 416.0416 446.4494 478.2788 488.7018 511.7806 514.5602 541.6888 559.0814 586.8912 599.2285 617.1360 644.3943 662.0924 685.8368 702.5869 706.5459 728.7551 736.4321 755.6617 760.1729 770.3008 781.6149 816.4882 816.8459 833.1831 859.2508 867.3268 885.9288 892.3988 919.6941 929.8738 969.4908 971.4914 980.2117 989.4268 993.7842 997.9280 1002.6550 1017.6913 1026.5206 1037.4162 1045.5361 1069.9399 1079.9907 1096.9378 1101.4405 1139.7738 1151.7048 1155.6726 1156.6987 1170.3114 1172.0947 1181.4745 1189.2181 1195.9407 1225.7212 1238.8526 1255.1857 1274.7765 1279.8021 1309.6478 1331.7545 1344.3327 1356.5572 1379.8491 1380.6290 1385.8112 1394.6306 1430.3367 1439.8806 1449.5567 1454.4737 1458.1769 1464.8251 1465.1577 1474.3443 1482.3697 1483.7960 1500.4079 1560.3632 1588.7080 1594.3593 1609.3838 1612.0774 1639.0225 1686.0338 2994.5954 2997.4281 3003.2637 3019.0462 3032.1280 3081.2223 3087.5359 3095.0985 3096.6556 3117.2287 3121.3772 3124.2343 3134.9837 3139.4757 3139.9639 3145.3659 3154.7581 3162.2722 3169.7887 3191.7898 3492.2095
redmass: 5.9664 7.5506 4.2232 6.6271 4.0284 4.1555 5.1104 4.5479 2.4332 1.8618 2.4328 3.4874 4.0208 4.5706 4.2074 4.9197 2.8486 2.1008 3.4962 3.9477 6.0796 5.4026 3.0102 8.0324 4.4722 2.1145 3.3465 3.1032 4.1477 4.3091 4.6747 4.5720 4.7964 3.9833 4.5621 3.4444 4.7637 4.7455 6.1996 5.3409 5.3238 3.5616 1.4113 2.1036 1.9658 3.6707 3.4748 2.2914 4.5314 1.5866 2.2953 1.8182 4.8918 1.2466 3.9042 1.6170 2.7948 2.5643 1.8540 1.3765 2.2110 1.3893 5.7790 2.1029 1.3448 1.3374 3.0211 2.2075 2.4301 1.6275 3.6058 1.9030 2.2350 2.4152 2.4366 1.6828 2.9085 1.6009 1.4222 1.0630 1.8005 1.1789 1.7822 1.7428 1.3930 1.6923 1.4479 1.2050 1.8777 1.2772 1.3550 1.3045 8.1077 7.3532 1.2543 1.2281 2.3033 2.1334 1.0676 1.0552 1.0987 1.0456 2.3442 1.1367 1.2129 1.7350 2.1651 6.5782 5.9629 7.2556 6.5941 6.0525 9.6563 10.7295 1.0364 1.0401 1.0792 1.0627 1.0593 1.1039 1.0981 1.0918 1.1029 1.0863 1.1056 1.0869 1.0921 1.1027 1.0864 1.0962 1.0912 1.1014 1.0978 1.0961 1.0791
irintensity: 0.2033 1.1300 0.6720 1.7989 1.6781 0.6617 1.2567 0.0976 1.8643 3.4570 2.0202 4.8399 2.5156 1.9321 0.5615 1.7616 1.1344 2.2630 3.6449 1.4570 6.7134 3.1946 10.7606 2.9421 11.4758 0.9231 2.0050 1.4396 1.9519 4.4074 5.9590 6.6551 10.9158 10.7942 9.2525 4.7741 11.5095 10.8737 0.3297 5.8145 4.4327 79.8091 56.5666 55.3204 35.5566 31.1378 3.9230 15.0181 10.1900 61.1003 11.7948 4.4608 22.4319 0.0941 64.9653 7.1143 13.0035 2.8398 3.0152 1.2395 19.9271 1.6412 0.8832 75.6786 1.4030 2.0417 85.0784 3.7660 16.3959 16.8811 41.5293 62.1243 23.4271 12.7017 140.3278 17.3847 334.7233 11.8041 4.4684 0.1682 5.4660 3.5239 38.5723 32.8878 5.2189 35.1077 30.4028 9.1892 20.9488 1.4025 9.7184 1.0224 0.5218 0.6143 48.3173 9.3510 8.5418 3.3579 11.0321 14.2889 21.8154 16.5626 98.6314 23.5676 26.1732 20.2769 401.0477 92.4095 1.7145 94.5745 26.8352 4.3088 144.5316 166.1914 14.1929 4.8337 10.5252 16.8222 29.0070 4.4823 41.3735 2.6570 4.7548 3.2477 26.2185 1.2864 12.5574 7.1086 4.3092 35.8826 5.9532 14.7411 22.6158 3.7700 105.0534
temp: 298.150 k
press: 1.00000 atm
elementType: 8 8 8 8 8 7 6 6 6 6 6 6 6 6 6 6 6 6 6 6 6 6 6 6 6 6 1 1 1 1 1 1 1 1 1 1 1 1 1 1 1 1 1 1 1 1 1
symmnumber: 1
zpe: 970938.6 jmol-1
zpe.correction: 0.369811 hartree
zpe.thermalcorrener: 0.395192 hartree
zpe.thermalcorrenthalpy: 0.396136 hartree
zpe.thermalcorrgfe: 0.310940 hartree
zpe.sumelectzpe: -1203.742998 hartree
zpe.sumelectthermal: -1203.717617 hartree
zpe.sumelectthermalent: -1203.716673 hartree
zpe.sumelectthermalfe: -1203.801869 hartree
dipole: 1.0546 2.6682 4.0936
dipole: 4.9989
quadrupole: -138.0700 -162.1758 -147.0347
quadrupole: 8.2067 4.7559 -0.6629
quadrupole: 11.0235 -13.0823 2.0588 8.2067 4.7559 -0.6629
hfenergy: -1204.1128092 hartree
pointgroup: C01 [X(C20H21N1O5)]
dipole: -0.4391429 1.4866733 -1.2103627 debye
polarizability: 249.3371613|61.2765938|208.4369122|1.0887472|-23.6236256|238.2893223 unknown
InChI: InChI=1S/C20H21NO5/c1-3-25-20(24)17(13-15-9-5-4-6-10-15)21-19(23)16-11-7-8-12-18(16)26-14(2)22/h4-12,17,21H,3,13H2,1-2H3
charge 0 multiplicity 1
47 atoms
O  0.713395 2.413718 0.803483
O  2.60647 2.229993 2.153311
O  -0.472586 -1.830965 2.671977
O  -1.856197 0.176424 -0.834723
O  -2.113913 -0.669298 -3.020823
N  -0.125575 -0.039685 1.245809
C  1.169097 0.263966 1.852984
C  2.318574 -0.701535 1.372216
C  2.541107 -0.690584 -0.129793
C  1.584909 1.718826 1.641408
C  -0.872967 -1.103493 1.700938
C  3.482159 0.193285 -0.721671
C  1.798184 -1.555338 -0.9769
C  -2.201269 -1.376787 1.02681
C  3.670573 0.218471 -2.1225
C  1.982817 -1.533104 -2.378386
C  -2.67382 -0.812452 -0.190743
C  2.919168 -0.643212 -2.956562
C  -3.04686 -2.307998 1.685904
C  1.036573 3.856157 0.547602
C  -3.935065 -1.148352 -0.725867
C  -4.306819 -2.657498 1.165163
C  -4.752444 -2.073652 -0.043611
C  2.028123 3.999572 -0.609187
C  -1.617686 0.166623 -2.248899
C  -0.666881 1.28555 -2.595244
H  1.083295 0.102976 2.946017
H  2.029211 -1.708197 1.721488
H  3.234858 -0.4000 1.910629
H  -0.472966 0.531733 0.469513
H  4.075963 0.853372 -0.077036
H  1.084243 -2.25849 -0.531965
H  4.409534 0.898593 -2.561671
H  1.405486 -2.212586 -3.015495
H  3.071387 -0.632388 -4.041764
H  -2.666026 -2.745509 2.61441
H  1.440411 4.28803 1.479785
H  0.055064 4.300363 0.316868
H  -4.265815 -0.700644 -1.665172
H  -4.938169 -3.377549 1.695531
H  -5.731157 -2.33582 -0.459132
H  2.175148 5.071502 -0.837692
H  1.654377 3.49972 -1.519567
H  3.005751 3.565881 -0.342798
H  -0.790844 2.137841 -1.909924
H  -0.827091 1.595493 -3.639163
H  0.370577 0.913147 -2.498458
