program: Gaussian 09
title: 000014118
version: EM64L-G09RevD.01
frameworkgroup: C1[X(C12H14N2)]
method: RPBEPBE
basis: SDD
operation: Freq
keyword: #pfreq=noraman
keyword: PBEPBE/SDD
title: #p freq=noraman PBEPBE/SDD
converged: YES YES NO NO
title: Mulliken charges:
elementType: N N C C C C C C C C C C C C H H H H H H H H H H H H H H
charge: -0.479240 -0.720977 0.127921 0.194463 -0.506899 -0.502757 -0.411028 -0.398436 0.181975 0.194691 -0.645165 -0.341192 0.537438 -0.440745 0.210368 0.213124 0.220974 0.214704 0.201331 0.205271 0.202791 0.210566 0.289464 0.220186 0.221178 0.207479 0.295921 0.296595
chargesum: 0.00000
title: Mulliken charges with hydrogens summed into heavy atoms:
elementType: N N C C C C C C C C C C C C
charge: -0.189776 -0.128461 0.127921 0.194463 -0.083407 -0.067079 -0.004426 0.014921 0.181975 0.194691 -0.424979 -0.120013 0.537438 -0.233267
polarizability: 2.15206386e+02 8.08835240e+00 1.45278695e+02 -4.48181689e-01 -1.24904505e+00 7.51218994e+01
1716.lowfreq: -0.0006 -0.0005 -0.0005 5.5969 12.5749 16.5979 73.9306 107.3353 167.0360
frequency: 73.9173 107.3232 167.0237 173.7871 201.5490 243.9119 290.5562 310.2436 322.0143 346.4774 365.4043 377.1688 425.2039 445.5613 448.3054 496.3361 513.1342 575.5823 606.8250 647.3488 669.1497 700.7811 745.5033 786.1861 808.1198 819.5409 826.1125 850.6075 861.2640 908.5316 910.3088 918.1725 965.8649 987.4261 1034.9247 1077.7611 1088.8144 1130.0305 1132.9609 1147.5219 1151.2036 1210.7419 1232.4423 1234.9916 1247.7489 1256.8245 1282.6169 1322.8648 1334.1034 1337.7189 1339.1374 1364.9685 1414.9661 1449.3043 1459.1008 1464.7509 1467.1750 1474.9026 1477.0798 1498.0102 1584.0467 1604.4340 1635.4760 1648.5992 2945.1480 2945.4644 2974.6524 2979.3171 2997.8578 3000.9104 3037.7482 3047.6271 3114.1664 3119.0977 3139.6002 3575.4096 3609.8815 3717.4012
redmass: 3.3130 3.0205 3.9805 2.7666 3.3561 1.2298 1.8681 2.4930 1.1648 3.1330 3.9827 6.0046 2.4120 3.0735 1.2298 3.4694 3.4298 4.0358 2.9611 3.7421 3.0644 4.2969 3.3804 1.5448 3.6802 2.2391 2.3766 1.7940 2.5234 1.4710 1.3537 2.8485 2.1827 2.4071 1.4862 1.8021 1.9336 1.1546 1.6346 1.8426 1.6472 1.3902 1.9416 1.3000 1.6361 1.6443 1.6115 1.9429 1.7725 1.5356 1.4084 2.3431 4.9956 1.9010 1.2189 1.2897 1.2127 1.3416 2.3169 5.2444 6.7358 5.7412 1.1912 6.2280 1.0628 1.0626 1.0650 1.0690 1.0899 1.0923 1.0994 1.1043 1.0868 1.0910 1.0969 1.0445 1.0803 1.1041
irintensity: 2.9557 1.5382 1.6795 4.6701 5.7206 285.9464 0.7592 2.5657 21.2079 5.7080 0.3609 0.4022 0.0117 6.5341 89.6064 4.0955 2.5589 2.3077 22.6535 1.2612 2.2833 0.2871 0.5552 49.0399 10.9919 5.3222 1.0581 41.8989 1.1921 0.4369 0.1776 5.3030 5.7024 1.0103 2.7927 0.7416 2.3763 3.7341 16.5498 9.1428 2.7459 3.0306 35.9841 3.9272 23.4675 31.4521 0.1048 5.1459 26.8978 8.9008 11.8673 6.1692 30.2390 39.0281 3.9030 25.5569 1.1206 21.6562 42.2737 56.4384 14.1080 48.4038 112.4396 155.5548 93.2568 16.8897 26.1577 25.0842 80.9076 22.5020 84.5648 69.9843 9.4372 28.2142 29.7678 55.9967 42.9789 16.3270
temp: 298.150 k
press: 1.00000 atm
elementType: 7 7 6 6 6 6 6 6 6 6 6 6 6 6 1 1 1 1 1 1 1 1 1 1 1 1 1 1
symmnumber: 1
zpe: 617301.5 jmol-1
zpe.correction: 0.235118 hartree
zpe.thermalcorrener: 0.247088 hartree
zpe.thermalcorrenthalpy: 0.248032 hartree
zpe.thermalcorrgfe: 0.197986 hartree
zpe.sumelectzpe: -574.192039 hartree
zpe.sumelectthermal: -574.180069 hartree
zpe.sumelectthermalent: -574.179124 hartree
zpe.sumelectthermalfe: -574.229171 hartree
dipole: 0.2805 0.5395 0.0002
dipole: 0.6081
quadrupole: -66.6116 -68.7660 -88.9376
quadrupole: 5.7333 -0.1915 -0.5231
quadrupole: 8.1601 6.0057 -14.1659 5.7333 -0.1915 -0.5231
hfenergy: -574.4271566 hartree
pointgroup: C01 [X(C12H14N2)]
dipole: 0.1077417 0.2136081 -0.0013752 debye
polarizability: 214.9959834|8.9400144|145.4696977|-0.6368503|-1.6989595|75.1412994 unknown
InChI: InChI=1S/C12H14N2/c13-8-5-6-12-10(7-8)9-3-1-2-4-11(9)14-12/h5-7,14H,1-4,13H2
charge 0 multiplicity 1
28 atoms
N  0.526578 1.797551 -0.053297
N  -4.018245 -1.49434 0.055479
C  0.952521 -0.447011 0.010201
C  1.536035 0.822001 -0.027043
C  1.770116 -1.717171 0.048048
C  3.011957 1.115543 -0.048808
C  3.243399 -1.42437 -0.348096
C  3.791012 -0.162978 0.367709
C  -0.485614 -0.261118 0.010871
C  -0.727662 1.158885 -0.032395
C  -1.586434 -1.155795 0.040056
C  -2.034016 1.685181 -0.04346
C  -2.905559 -0.635748 0.02742
C  -3.115804 0.783452 -0.013924
H  1.743197 -2.166117 1.064064
H  1.343781 -2.479248 -0.635099
H  3.331786 1.430404 -1.06515
H  3.266488 1.952416 0.633526
H  3.878633 -2.298748 -0.108094
H  3.302996 -1.2694 -1.444382
H  4.86624 -0.031298 0.140602
H  3.701706 -0.30231 1.463348
H  0.679052 2.802883 -0.080796
H  -1.423013 -2.240172 0.074327
H  -2.219042 2.765253 -0.074983
H  -4.142858 1.169281 -0.022771
H  -4.96178 -1.121444 0.049049
H  -3.895773 -2.501186 0.085596
