program: Gaussian 09
title: 000156806
version: EM64L-G09RevD.01
frameworkgroup: C1[X(C11H14N2O6)]
method: RPBEPBE
basis: SDD
operation: Freq
keyword: #p
keyword: freq=noraman
keyword: PBEPBE/SDD
title: #p freq=noraman PBEPBE/SDD
converged: YES YES NO NO
title: Mulliken charges:
elementType: O O O O O O N N C C C C C C C C C C C H H H H H H H H H H H H H H
charge: -0.446920 -0.495915 -0.441220 -0.489230 -0.208591 -0.209528 -0.176298 0.023495 -0.141459 -0.080231 -0.156600 -0.356920 -0.157203 0.332874 -0.352550 -0.322218 0.385208 -0.333892 -0.354760 0.226304 0.233385 0.266750 0.233689 0.204264 0.259231 0.367131 0.376339 0.353143 0.362974 0.261892 0.256988 0.290715 0.289154
chargesum: 0.00000
title: Mulliken charges with hydrogens summed into heavy atoms:
elementType: O O O O O O N N C C C C C C C C C C C
charge: -0.079789 -0.119577 -0.088076 -0.126256 -0.208591 -0.209528 -0.176298 0.023495 0.084845 0.153154 0.110149 0.081032 0.102028 0.332874 -0.090658 -0.065229 0.385208 -0.043177 -0.065606
polarizability: 2.80912603e+02 -2.85036098e+01 1.17155194e+02 -2.54447429e+00 -1.75353498e+01 1.38527058e+02
1716.lowfreq: -7.3110 -0.0007 -0.0006 -0.0002 5.0623 7.4261 20.8355 26.3776 47.8093
frequency: 20.7508 26.3338 47.8045 53.7105 69.6163 74.4179 103.0896 108.2666 143.8273 154.1531 175.2632 225.7000 253.0698 258.7946 263.7765 273.7805 290.0997 319.3007 329.0787 398.0403 413.5250 418.2845 445.2137 463.1248 482.6364 514.1144 518.9982 536.6114 577.6023 621.6693 633.7014 666.1136 698.2565 730.3909 741.6205 778.0053 830.8847 833.8364 842.3819 860.2531 870.3487 927.9929 965.3942 977.6511 981.2934 990.4402 994.6024 999.7620 1035.2677 1048.6221 1069.0839 1093.1490 1105.3777 1110.6326 1169.2112 1171.4822 1188.3147 1197.4328 1207.7799 1220.5008 1231.3050 1253.7543 1288.0413 1291.6500 1327.1236 1329.4507 1344.8156 1358.6436 1374.1282 1389.8832 1397.6071 1400.1221 1423.8669 1432.3629 1462.9376 1474.5884 1583.7376 1600.4100 1633.4961 2930.6121 2965.1087 2975.0867 3014.2046 3027.7474 3058.7334 3150.2819 3163.5174 3183.3468 3188.4898 3234.8265 3499.3379 3577.1121 3605.5298
redmass: 6.1984 6.6414 4.7512 6.9800 6.8854 6.1739 3.6778 5.0178 6.0798 5.5487 4.9756 7.2942 1.5913 1.8536 1.5791 2.9832 4.2957 6.4625 5.9600 5.8915 3.0011 3.4175 6.2697 3.9821 4.4385 5.7595 1.1341 3.4727 3.5408 6.7448 7.4724 4.4140 1.8158 1.7496 4.9722 7.2656 1.7947 4.3214 1.8307 2.6835 2.1425 1.9796 4.7933 4.2730 1.3825 1.4955 2.3900 2.8790 2.1970 2.1069 2.4105 3.2306 2.0831 1.4419 1.2334 1.2979 1.1571 1.2798 2.4716 5.4644 1.1988 1.4625 1.1883 1.2782 1.2716 1.2152 1.3865 5.3354 1.4055 3.0137 1.6863 2.3649 3.7236 1.2958 1.0817 2.4774 7.8214 6.7021 7.9005 1.0803 1.0714 1.0725 1.0888 1.0864 1.1028 1.0901 1.0901 1.0951 1.0966 1.0663 1.0650 1.0667 1.0670
irintensity: 0.2431 0.2145 3.1842 1.2086 0.1667 5.8763 7.5093 7.7487 8.5179 3.6990 9.0005 8.1691 67.4394 104.4200 76.6486 40.8938 7.7746 3.5998 6.1155 3.3495 1.4897 6.3200 15.7935 41.6870 4.4885 2.0901 154.5768 26.6409 40.1718 5.2967 16.3007 28.5962 56.6250 127.8830 2.0277 13.2559 33.2940 12.1576 26.3589 12.4029 52.6413 40.9514 86.0365 65.2706 2.1865 9.5380 75.0598 15.1951 27.0185 59.2163 27.3178 25.7733 2.4381 37.9662 106.2617 74.3719 39.8272 35.9577 15.6989 435.6504 7.8382 20.8676 28.4407 0.3405 48.9348 24.2212 8.1852 73.3176 23.5653 70.1438 12.4576 1.0461 35.1023 70.7961 7.9319 14.0004 13.8798 203.7520 56.5762 26.8033 14.8360 56.1670 36.7113 67.5298 49.8900 3.8392 2.7083 0.9013 3.6613 319.7094 37.9772 16.1459 9.5076
temp: 298.150 k
press: 1.00000 atm
elementType: 8 8 8 8 8 8 7 7 6 6 6 6 6 6 6 6 6 6 6 1 1 1 1 1 1 1 1 1 1 1 1 1 1
symmnumber: 1
zpe: 650124.3 jmol-1
zpe.correction: 0.247619 hartree
zpe.thermalcorrener: 0.266736 hartree
zpe.thermalcorrenthalpy: 0.267680 hartree
zpe.thermalcorrgfe: 0.197910 hartree
zpe.sumelectzpe: -986.844748 hartree
zpe.sumelectthermal: -986.825631 hartree
zpe.sumelectthermalent: -986.824687 hartree
zpe.sumelectthermalfe: -986.894457 hartree
dipole: -6.4493 -0.5120 -1.1723
dipole: 6.5749
quadrupole: -132.1381 -105.6457 -113.8195
quadrupole: 12.3438 2.9034 -7.6973
quadrupole: -14.9370 11.5554 3.3816 12.3438 2.9034 -7.6973
hfenergy: -987.0923671 hartree
pointgroup: C01 [X(C11H14N2O6)]
dipole: 2.5196865 -0.0795694 0.5798566 debye
polarizability: 281.7379217|25.0262072|127.9639041|-5.3919378|21.4031157|126.8930295 unknown
InChI: InChI=1S/C11H14N2O6/c14-6-10(16)11(17)9(15)5-12-7-1-3-8(4-2-7)13(18)19/h1-5,9-11,14-17H,6H2
charge 0 multiplicity 1
33 atoms
O  2.640706 -0.497197 -1.704875
O  4.243903 0.237687 1.575465
O  2.777529 2.732533 -1.090686
O  4.804053 -2.396518 1.540547
O  -5.831716 -1.114632 -0.806129
O  -5.843491 0.152378 1.092539
N  0.396949 0.323523 -0.416179
N  -5.238955 -0.398792 0.091705
C  3.287162 0.2812 -0.656215
C  3.567716 -0.60933 0.577973
C  2.516735 1.568797 -0.224101
C  4.468093 -1.799076 0.229158
C  1.01372 1.453921 -0.193197
C  -1.009894 0.188592 -0.276497
C  -1.705588 -0.60902 -1.22695
C  -1.720644 0.769525 0.813525
C  -3.778323 -0.196111 -0.034893
C  -3.092914 -0.795112 -1.117363
C  -3.107322 0.579223 0.936897
H  4.257613 0.606896 -1.075898
H  2.61411 -0.995242 0.997528
H  2.855861 1.791026 0.814409
H  3.929032 -2.509738 -0.423356
H  5.386636 -1.443607 -0.282745
H  0.475917 2.403127 -0.005891
H  1.673866 -0.567075 -1.427966
H  4.678332 -0.386629 2.21737
H  3.689567 3.068826 -0.902877
H  5.415603 -3.163261 1.423719
H  -1.144041 -1.065527 -2.047397
H  -1.176719 1.341747 1.572449
H  -3.651989 -1.393128 -1.841329
H  -3.677108 1.010593 1.764062
