program: Gaussian 09
title: 000156754
version: EM64L-G09RevD.01
frameworkgroup: C1[X(C23H19ClF3NO3)]
method: RPBEPBE
basis: SDD
operation: Freq
keyword: #p
keyword: freq=noraman
keyword: PBEPBE/SDD
title: #p freq=noraman PBEPBE/SDD
converged: YES YES NO NO
title: Mulliken charges:
elementType: Cl F F F O O O N C C C C C C C C C C C C C C C C C C C C C C C H H H H H H H H H H H H H H H H H H H
charge: -0.012927 -0.152445 -0.150050 -0.156540 -0.266703 -0.275854 -0.310703 0.012754 0.304880 -0.268871 -0.383235 -0.731967 -0.717746 0.015051 0.318840 -0.284301 -0.198301 0.366062 0.540585 -0.191893 -0.521110 -0.443717 0.345569 -0.196192 -0.389672 0.348310 -0.355804 -0.385497 -0.201122 -0.193417 -0.247055 0.268935 0.282062 0.224695 0.223146 0.253011 0.229549 0.219904 0.228811 0.290173 0.286389 0.288980 0.263903 0.236424 0.264926 0.265897 0.257391 0.234219 0.231615 0.233045
chargesum: 0.00000
title: Mulliken charges with hydrogens summed into heavy atoms:
elementType: Cl F F F O O O N C C C C C C C C C C C C C C C C C C C C C C C
charge: -0.012927 -0.152445 -0.150050 -0.156540 -0.266703 -0.275854 -0.310703 0.012754 0.304880 0.000063 -0.101174 -0.031116 -0.039482 0.305224 0.318840 -0.284301 0.088088 0.366062 0.540585 -0.191893 -0.232130 -0.179814 0.345569 0.040232 -0.124746 0.348310 -0.089908 -0.128106 0.033097 0.038197 -0.014010
polarizability: 3.60832114e+02 -2.56121359e+01 2.63849248e+02 2.24870902e+01 3.97369605e+00 2.28983495e+02
1716.lowfreq: -5.4824 -2.1113 0.0004 0.0010 0.0017 2.5873 8.2377 9.2508 14.8938
frequency: 8.0113 9.1415 14.6898 25.2109 30.0780 34.1788 40.9352 46.4750 56.6412 74.4104 78.2973 92.9750 99.5082 128.6269 145.5735 164.3491 166.2692 178.0076 189.9704 197.7669 208.6030 218.8883 226.1621 249.5108 261.8721 286.5387 301.5738 318.1063 330.6859 334.2855 352.3069 368.3367 377.5261 407.1781 410.7995 420.5827 438.6708 451.0673 462.6692 478.7389 487.2544 496.3234 538.0620 562.3263 579.0531 585.1513 591.7316 610.6297 627.7055 629.5572 640.2350 646.0868 691.2258 698.5390 703.8587 735.9256 741.5251 765.7953 778.8187 802.5553 814.4300 825.7834 836.1676 851.1577 891.6175 900.1928 913.3098 916.8638 919.1887 942.6744 957.9567 959.7159 970.4357 970.8682 984.1929 986.5483 987.3864 990.7751 995.8544 998.0426 999.1266 1019.8922 1024.1277 1044.2164 1054.3248 1078.4111 1088.7567 1115.8962 1125.3395 1141.1865 1168.2289 1174.0434 1177.6611 1183.1639 1194.0739 1214.5372 1230.9024 1235.8176 1270.3473 1276.5277 1281.5936 1308.0854 1312.3544 1327.2245 1365.6273 1382.0929 1389.8754 1392.9503 1396.9364 1409.7982 1440.4191 1446.3214 1464.4912 1465.3510 1470.8846 1479.1553 1483.3992 1490.6490 1594.7904 1595.6645 1605.1105 1613.6581 1617.9344 1663.6813 2206.5609 2977.6509 2989.7856 3024.0293 3071.6434 3075.9036 3079.6880 3108.6445 3124.3177 3134.4378 3137.3438 3142.0924 3143.2298 3152.8807 3156.4985 3157.6170 3158.9933 3166.6539 3175.7068 3176.1675
redmass: 7.0143 8.0815 9.5179 7.4933 5.7409 7.8458 11.6252 5.0511 5.3162 7.7444 4.3229 7.0317 8.3509 6.4099 2.9487 2.0571 6.1558 3.3260 2.3063 3.1600 5.1209 3.8284 1.8137 6.3007 6.2622 6.2778 5.6674 5.1611 6.1417 12.5900 4.4933 3.2724 5.3089 5.6149 3.2133 6.8753 3.9782 4.6940 3.8804 3.4821 11.7596 3.1946 6.8625 7.6322 8.6369 6.0928 8.8036 6.3164 5.9355 5.4642 4.8883 8.4037 2.3785 2.3867 5.2003 4.3131 5.9484 1.7778 4.0875 1.8760 3.5426 5.6893 1.3152 4.4161 4.9938 1.4989 1.4395 1.4574 1.5611 2.9922 2.5961 1.5145 1.3885 1.5808 1.4951 3.9474 5.6731 1.3330 1.8579 3.6449 4.1021 2.0882 6.3986 2.6191 1.4101 1.5081 1.6095 1.9271 1.7361 1.9632 1.1909 1.1729 1.1356 3.5785 2.1075 2.8660 2.4845 2.5397 1.3476 1.3573 1.5599 1.3521 2.3940 1.4566 1.6138 8.1952 1.3009 7.6340 1.7848 1.4775 2.3591 2.5655 1.0520 1.0516 2.2747 2.5387 1.0989 1.0605 6.3046 6.5127 6.5208 6.5723 9.5218 8.4751 12.5928 1.0357 1.0374 1.0828 1.0997 1.0988 1.0999 1.0982 1.0898 1.0851 1.0877 1.0874 1.0890 1.0922 1.0899 1.0929 1.0934 1.0965 1.0988 1.1007
irintensity: 0.3965 0.1485 0.1452 0.8803 0.0600 0.3336 0.3690 0.8515 1.8848 1.7612 1.1287 2.1478 1.0811 0.7161 0.9419 0.2362 0.6422 0.7520 0.2411 5.8455 1.5472 1.4981 0.3127 5.4982 6.2412 13.5889 4.1841 0.3830 6.1485 0.4137 3.9368 8.3720 1.9692 10.9943 1.3466 4.4388 1.5452 3.4929 4.7777 18.8989 1.6139 2.1778 4.9392 0.4333 5.2000 2.7682 14.9280 0.6989 5.8877 2.6003 15.1764 19.4555 40.7548 16.9954 7.3300 14.2955 46.7459 149.4474 147.5960 29.4866 12.2043 110.1625 4.0788 16.3045 75.5959 14.1050 1.6533 5.6629 87.1486 21.9952 22.5123 5.9360 2.1793 15.1439 2.2542 22.0441 2.2015 1.0082 144.3426 67.4993 210.3358 17.8496 147.2875 315.8842 135.7594 11.8919 3.6449 229.6529 40.9256 3.6998 41.1591 43.9952 2.3825 34.2672 121.3402 255.6528 208.0899 161.1535 19.7974 11.3554 66.4052 1.0092 1.3717 11.7503 73.2433 6.7010 42.2028 12.9977 94.4357 40.4887 15.4913 56.2102 3.8443 8.5219 168.8381 25.6478 13.7377 12.6824 20.1358 134.1816 46.2253 12.8286 65.6662 75.4514 1.0110 23.5446 27.4495 19.7784 0.0888 44.3217 24.4354 8.2026 7.5809 1.9627 30.4161 5.2992 7.6379 6.0459 1.2697 19.9255 7.4199 12.6734 9.7255 5.6172
temp: 298.150 k
press: 1.00000 atm
elementType: 17 9 9 9 8 8 8 7 6 6 6 6 6 6 6 6 6 6 6 6 6 6 6 6 6 6 6 6 6 6 6 1 1 1 1 1 1 1 1 1 1 1 1 1 1 1 1 1 1 1
symmnumber: 1
zpe: 953335.3 jmol-1
zpe.correction: 0.363106 hartree
zpe.thermalcorrener: 0.393164 hartree
zpe.thermalcorrenthalpy: 0.394108 hartree
zpe.thermalcorrgfe: 0.295474 hartree
zpe.sumelectzpe: -1925.565936 hartree
zpe.sumelectthermal: -1925.535879 hartree
zpe.sumelectthermalent: -1925.534935 hartree
zpe.sumelectthermalfe: -1925.633568 hartree
dipole: 3.7355 2.1646 4.5997
dipole: 6.3084
quadrupole: -212.6120 -183.3610 -179.6146
quadrupole: -3.3773 -10.5136 -7.1465
quadrupole: -20.7495 8.5016 12.2479 -3.3773 -10.5136 -7.1465
hfenergy: -1925.9290426 hartree
pointgroup: C01 [X(C23H19Cl1F3N1O3)]
dipole: -1.1336609 0.7712802 -2.0687919 debye
polarizability: 334.5307274|34.606596|272.511875|49.9859966|10.3938539|246.6222546 unknown
InChI: InChI=1S/C23H19ClF3NO3/c1-22(2)17(12-19(24)23(25,26)27)20(22)21(29)31-18(13-28)14-7-6-10-16(11-14)30-15-8-4-3-5-9-15/h3-12,17-18,20H,1-2H3
charge 0 multiplicity 1
50 atoms
Cl 7.245844 -0.758594 0.612795
F  7.73423 1.62956 2.609851
F  6.866869 -0.162716 3.682042
F  5.598946 1.697464 3.379738
O  0.653591 -0.582431 0.325168
O  1.882444 1.100118 1.389057
O  -4.462546 0.635102 -1.555405
N  -1.393034 -2.760267 1.956873
C  3.549688 1.044724 -1.344184
C  4.306525 0.120241 -0.35714
C  2.766381 -0.06964 -0.591544
C  3.32825 2.516702 -1.005886
C  3.794069 0.779174 -2.829843
C  4.826573 0.616755 0.929407
C  1.784764 0.242966 0.473526
C  6.045295 0.324542 1.445117
C  -0.454297 -0.345891 1.336047
C  6.551325 0.859563 2.753119
C  -1.505073 0.592337 0.761773
C  -0.965963 -1.685847 1.667388
C  -2.512788 0.102241 -0.102807
C  -1.437816 1.969771 1.083246
C  -3.458383 1.005273 -0.636767
C  -2.384958 2.859788 0.528395
C  -3.398382 2.38484 -0.328399
C  -4.975449 -0.692422 -1.608941
C  -5.265233 -1.444048 -0.447234
C  -5.286686 -1.180753 -2.895527
C  -5.859638 -2.717707 -0.590171
C  -5.888615 -2.452287 -3.021551
C  -6.171919 -3.227187 -1.872321
H  4.915173 -0.659782 -0.82727
H  2.489682 -0.944728 -1.185173
H  4.251103 3.089828 -1.210137
H  2.524283 2.930059 -1.642098
H  3.042586 2.681251 0.044703
H  4.683492 1.337623 -3.175617
H  3.96327 -0.292394 -3.039054
H  2.926907 1.111776 -3.429679
H  4.177884 1.272101 1.5247
H  0.015823 0.110296 2.228504
H  -2.554642 -0.961925 -0.356683
H  -0.649401 2.337709 1.74806
H  -2.339963 3.926157 0.772112
H  -4.145853 3.05508 -0.762858
H  -5.043001 -1.044251 0.547057
H  -5.059433 -0.562714 -3.769207
H  -6.082038 -3.307583 0.305465
H  -6.132472 -2.836922 -4.017772
H  -6.633311 -4.21495 -1.973874
