program: Gaussian 09
title: 000014114
version: EM64L-G09RevD.01
frameworkgroup: C1[X(C10H11NO2)]
method: RPBEPBE
basis: SDD
operation: Freq
keyword: #p
keyword: freq=noraman
keyword: PBEPBE/SDD
title: #p freq=noraman PBEPBE/SDD
converged: YES YES NO NO
title: Mulliken charges:
elementType: O O N C C C C C C C C C C H H H H H H H H H H H
charge: -0.286030 -0.291241 -0.618502 0.483324 -0.312062 -0.385514 -0.392615 -0.153997 -0.391253 -0.232221 -0.235623 -0.241009 0.310987 0.217444 0.229486 0.227142 0.255865 0.240214 0.217032 0.226620 0.226954 0.229810 0.336220 0.338970
chargesum: 0.00000
title: Mulliken charges with hydrogens summed into heavy atoms:
elementType: O O N C C C C C C C C C C
charge: -0.286030 -0.291241 0.056688 0.483324 -0.094619 -0.156028 -0.165473 0.101868 0.065994 -0.005601 -0.008669 -0.011199 0.310987
polarizability: 2.00229499e+02 4.80341281e-01 1.15216889e+02 9.11830721e+00 -7.30967962e+00 7.19097119e+01
1716.lowfreq: -16.1062 -5.7532 -4.8970 -0.0009 -0.0007 -0.0004 23.7619 34.3692 45.8870
frequency: 23.7465 34.3357 45.8845 89.7470 124.0468 136.4637 229.4490 275.4621 304.6403 366.9467 402.8832 431.6815 471.9306 493.1066 517.1352 530.7095 607.8732 615.4686 624.8928 696.8891 704.0639 755.6768 774.6539 820.6083 846.7462 871.8215 924.7094 960.3874 975.7201 978.0098 987.2815 990.3203 1000.0685 1027.6255 1055.9813 1079.2408 1116.6812 1172.9218 1192.2305 1224.3260 1235.4854 1288.7694 1304.8385 1308.3444 1338.8852 1364.8129 1387.6490 1439.9317 1448.0040 1485.6470 1584.7482 1586.1846 1611.9127 1664.9434 1681.3927 3017.2140 3076.2847 3101.4395 3117.3017 3126.3766 3132.4950 3139.5273 3150.2628 3165.6743 3558.5864 3717.1056
redmass: 4.3574 6.6322 5.0683 3.7969 3.5057 4.8173 3.7120 3.6102 3.4179 3.0382 2.7732 3.8312 2.8264 1.1785 1.0798 3.4435 4.5875 6.4333 4.9482 1.7401 10.4513 2.4402 2.4630 3.2571 1.3184 1.8893 1.5278 3.4792 2.4052 1.5825 1.3409 4.1020 1.2584 2.1339 1.9821 1.7896 2.6470 1.0601 1.1191 1.7192 1.3192 1.3906 1.6879 1.8610 1.2621 1.6293 5.0970 2.0521 1.1743 2.3031 5.7510 1.2202 5.9588 5.9898 6.8499 1.0601 1.0901 1.1027 1.0872 1.0865 1.0914 1.0913 1.0958 1.1015 1.0445 1.1058
irintensity: 0.3839 1.3919 7.6045 2.6322 1.9972 2.7169 9.4583 1.8953 8.9816 6.6312 0.0103 17.4662 13.9048 309.1423 26.3313 2.0517 0.9545 0.0239 3.0292 47.9482 35.3037 30.2783 41.4276 1.6910 0.4306 5.7742 2.4045 132.6329 133.4112 23.5783 28.6286 8.3237 19.2768 8.1136 10.6245 11.0745 23.7097 0.1590 1.8233 9.7569 33.0124 78.2489 232.5371 159.2585 6.8230 57.3680 2.4412 16.5114 27.9142 14.9917 1.9153 107.2783 1.4307 18.7298 351.4936 30.7503 18.9238 7.2572 9.0532 2.4077 18.9519 9.2119 40.9364 24.5074 69.1481 48.6151
temp: 298.150 k
press: 1.00000 atm
elementType: 8 8 7 6 6 6 6 6 6 6 6 6 6 1 1 1 1 1 1 1 1 1 1 1
symmnumber: 1
zpe: 499537.7 jmol-1
zpe.correction: 0.190264 hartree
zpe.thermalcorrener: 0.202624 hartree
zpe.thermalcorrenthalpy: 0.203568 hartree
zpe.thermalcorrgfe: 0.149206 hartree
zpe.sumelectzpe: -591.916946 hartree
zpe.sumelectthermal: -591.904586 hartree
zpe.sumelectthermalent: -591.903641 hartree
zpe.sumelectthermalfe: -591.958003 hartree
dipole: 0.0172 -0.9955 2.1148
dipole: 2.3374
quadrupole: -61.0133 -69.9811 -77.9361
quadrupole: 1.2451 -9.7547 2.8036
quadrupole: 8.6302 -0.3376 -8.2926 1.2451 -9.7547 2.8036
hfenergy: -592.1072094 hartree
pointgroup: C01 [X(C10H11N1O2)]
dipole: 0.0068151 0.1309353 0.9102251 debye
dipolederiv: -1.410451 0.4344484 -0.0308407 0.9128641 -0.9779512 -0.0054648 -0.1076227 -0.1547422 -0.4594829 -0.6321341 0.1141488 -0.0945573 0.2682322 -0.5826975 -0.1988296 -0.0302095 -0.1970444 -0.9908681 -1.1394463 0.0620919 -0.2889424 0.2577656 -0.6202286 0.357165 -0.4203335 0.3508902 -0.7413157 0.1567815 0.0096887 -0.0077034 -0.0023347 -0.0427961 -0.0458178 -0.0058387 -0.0602803 0.0350812 0.2829356 0.0838551 -0.0505952 0.1976954 0.1557486 0.106073 -0.0618588 0.1319011 -0.0755614 -0.0805324 -0.0553725 -0.053624 -0.0669222 -0.0623981 0.0586753 -0.0530177 0.0541514 -0.1060149 -0.1455815 0.0505594 0.0090994 -0.0110554 0.0480134 0.1086921 -0.0085689 0.1066921 -0.1280086 -0.4074164 -0.0212002 -0.0368681 -0.0486641 -0.0695571 0.1358751 0.0541321 0.1707073 -0.2028528 1.1527513 -0.1565557 0.0364427 -0.1007883 0.4498509 -0.1083393 0.4740679 -0.1682662 0.3022134 -0.1059779 0.0327517 0.004439 0.0942037 0.0940188 0.1073525 0.0375649 0.115795 -0.0934963 0.0873113 -0.0692634 -0.0849282 -0.112521 -0.0393842 0.0769384 -0.1132125 0.0712349 -0.0910089 -0.004423 0.0581992 -0.0162143 0.003339 -0.0670853 0.0467489 -0.034234 0.0393264 -0.1424329 1.5260017 -0.673106 0.432014 -1.328642 1.2642079 0.0591831 0.2441336 0.2086181 1.4921056 0.043895 -0.0180563 0.0162528 -0.0721284 -0.0795395 -0.0939488 -0.0101386 -0.1039845 0.0966648 -0.0054153 0.0786936 0.0787225 0.0592516 0.0567938 -0.054555 0.0666373 -0.0609634 0.0987554 0.0839652 -0.0692136 -0.0165559 -0.0386703 -0.0641404 -0.1013166 -0.003306 -0.0952968 0.1064348 0.1125696 -0.0360397 0.020286 -0.0952739 -0.0345576 -0.0764117 0.0408929 -0.0845522 0.1184751 -0.127167 -0.0210533 0.076576 -0.0017828 0.0972544 -0.018986 -0.0477765 0.0849585 -0.0487446 0.0233481 0.0702404 -0.0081489 -0.008979 -0.1027667 -0.033436 -0.044613 -0.0946956 0.068394 0.0679119 -0.0375133 -0.0005841 -0.0671926 -0.0706949 -0.1034124 -0.014274 -0.1071697 0.1039895 -0.0530565 0.0727151 0.0803054 0.0888654 0.0442901 -0.0766141 0.0914329 -0.074287 0.1026987 -0.1053624 -0.0817883 0.0158061 -0.0883669 0.0729455 -0.0272933 0.0151616 -0.0277721 0.146267 0.3463824 0.0900563 -0.0451284 0.0906126 0.2599463 -0.0445328 -0.0001458 -0.0625444 0.2126458 0.3331103 0.0817136 -0.0352528 0.0704918 0.2707277 -0.0677451 -0.068873 -0.042676 0.1960619 unknown
polarizability: 200.1816518|-0.7464121|107.310548|-8.8277133|18.5464361|79.8639001 unknown
InChI: InChI=1S/C10H11NO2/c11-10(12)13-8-4-7-9-5-2-1-3-6-9/h1-7H,8,11H2
charge 0 multiplicity 1
24 atoms
O  3.0815 0.450728 0.495072
O  3.587585 -1.105554 -1.208368
N  4.581322 -1.203434 0.918068
C  -1.696883 0.346784 0.006393
C  -0.348826 0.949269 0.017499
C  -1.977833 -0.923206 -0.576143
C  -2.772129 1.062296 0.605516
C  0.798619 0.415527 -0.491706
C  2.123369 1.123214 -0.448628
C  -3.282861 -1.453163 -0.553647
C  -4.079938 0.53271 0.628123
C  -4.34179 -0.7295 0.048154
C  3.743171 -0.671783 -0.038105
H  -0.28483 1.941489 0.491659
H  -1.173863 -1.497616 -1.049335
H  -2.574187 2.042546 1.057583
H  0.809385 -0.57085 -0.972057
H  2.600316 1.141598 -1.445786
H  2.037608 2.143142 -0.041076
H  -3.479732 -2.431565 -1.006417
H  -4.891533 1.101555 1.095383
H  -5.355444 -1.14501 0.062137
H  4.638495 -0.786076 1.843658
H  5.13218 -2.023401 0.681422
