program: Gaussian 09
title: 000156746
version: EM64L-G09RevD.01
frameworkgroup: C1[X(C12H19N2O5P)]
method: RPBEPBE
basis: SDD
operation: Freq
keyword: #p
keyword: freq=noraman
keyword: PBEPBE/SDD
title: #p freq=noraman PBEPBE/SDD
converged: YES YES NO NO
title: Mulliken charges:
elementType: P O O O O O N N C C C C C C C C C C C C H H H H H H H H H H H H H H H H H H H
charge: 1.386757 -0.509731 -0.512060 -0.608264 -0.208020 -0.203698 -0.755365 0.017205 -0.007847 -0.670062 -0.636057 0.276232 0.214337 -0.481356 0.491391 -0.232258 -0.328963 -0.395749 -0.802695 -0.661099 0.241988 0.358158 0.218298 0.202506 0.241725 0.233742 0.212157 0.206125 0.314308 0.271421 0.216198 0.276182 0.244606 0.241108 0.227069 0.243581 0.212279 0.230201 0.235651
chargesum: 0.00000
title: Mulliken charges with hydrogens summed into heavy atoms:
elementType: P O O O O O N N C C C C C C C C C C C C
charge: 1.386757 -0.509731 -0.512060 -0.608264 -0.208020 -0.203698 -0.397208 0.017205 0.234142 -0.007533 0.015967 0.276232 0.214337 -0.167048 0.491391 0.255362 -0.052782 -0.151144 -0.090937 0.017032
polarizability: 2.30442085e+02 -1.28809207e+01 1.95384302e+02 2.70470083e+00 2.45594478e+01 1.65291847e+02
1716.lowfreq: -8.1464 -5.7946 -0.0012 -0.0004 0.0004 3.7943 13.4618 23.3424 30.2826
frequency: 13.1135 23.0320 30.1351 35.7385 44.6815 48.8028 59.2691 75.5493 88.7058 103.6842 106.5063 142.3493 162.9867 179.5473 200.1425 207.6560 229.0960 239.3092 241.2337 250.3902 259.4380 281.3508 296.4550 340.6714 351.1183 376.3265 383.7756 397.5340 412.3978 435.2283 475.4231 498.3433 518.0854 552.1084 583.2401 604.2004 620.6328 669.0969 678.3712 735.4100 744.5054 772.2944 784.1348 826.0445 827.1692 870.2795 891.2320 905.3729 920.3304 939.1496 942.7472 967.8429 989.7804 1010.3752 1016.8542 1045.0037 1065.3358 1073.1989 1107.2819 1141.2972 1142.7706 1150.6970 1154.3359 1167.5445 1173.0972 1223.4934 1254.0371 1270.8738 1277.8325 1304.3321 1320.1443 1351.5795 1370.0781 1379.5747 1381.5115 1394.2150 1396.0031 1397.4793 1406.2968 1408.4664 1458.5087 1461.2905 1464.4774 1468.8655 1473.2772 1476.8603 1477.8742 1479.7095 1482.4101 1493.0559 1576.7964 1606.1618 2978.8284 2980.8054 2981.9226 2991.7029 2996.6534 3014.2111 3063.8564 3067.2511 3072.5843 3083.4148 3089.1733 3093.1088 3096.0397 3100.8074 3112.3746 3144.6667 3147.1378 3176.6994 3550.2469
redmass: 4.6792 3.4691 3.0865 1.0176 3.8159 4.6408 5.6895 4.4999 3.9482 4.7971 2.5295 5.0172 4.6402 5.7118 1.0427 4.9599 1.7830 1.1931 3.5420 2.6110 3.7327 5.0273 4.1979 7.2835 3.6003 2.1901 2.7101 5.5183 2.1796 3.2758 4.0180 3.9772 3.5762 5.7053 4.3149 6.7253 8.2299 5.2683 6.0679 4.5265 6.9280 9.5324 3.0073 1.0898 1.3751 3.1060 3.7562 1.3828 1.2545 1.3642 2.8591 1.3802 2.6948 1.6053 2.5477 1.6263 5.1285 6.8009 2.2632 1.4526 2.1495 2.1874 1.5051 1.9828 2.0375 10.9416 2.8206 1.1509 1.6711 1.2523 1.3867 5.6623 1.2725 1.2164 7.4222 1.2411 1.2455 1.2228 2.8251 1.3348 1.0397 1.0457 1.0524 1.2839 1.0626 1.4146 1.4023 1.0558 1.0557 1.0887 6.9031 6.2229 1.0362 1.0394 1.0372 1.0555 1.0384 1.0849 1.0940 1.1076 1.0989 1.0986 1.1006 1.0979 1.1004 1.1005 1.1028 1.0898 1.0930 1.0956 1.0761
irintensity: 2.2141 0.3584 0.3181 0.2574 1.4148 0.8474 1.6302 0.4465 1.6278 2.5281 8.1470 13.6198 1.4426 4.5323 0.0561 3.7990 1.0305 0.2857 1.5797 1.8226 0.2861 6.4328 15.6700 1.2473 3.9805 13.0498 13.3844 38.3608 1.9758 3.3457 9.3933 37.4118 159.1680 23.6987 13.5787 9.3675 114.4705 6.0340 117.5292 9.5680 72.6814 21.9546 55.1602 5.6569 34.3878 23.7499 202.1529 33.5543 7.1781 1.9035 95.4880 4.5544 97.5823 21.7817 107.8863 28.6524 44.3724 87.7492 23.8245 11.5741 39.3132 72.9806 10.7559 72.5643 49.1386 300.0798 62.7718 9.6306 43.9017 14.7466 3.5182 98.8689 12.1463 17.2102 21.1890 56.2473 24.3419 23.8532 126.1603 27.4307 11.8685 0.8782 3.1851 16.1937 12.0728 56.1607 52.2441 12.2574 6.5931 5.4177 49.9821 159.6897 18.6628 17.8374 25.5492 20.2616 24.2049 1.4297 17.2289 3.8613 4.2540 62.2745 32.7016 22.9048 14.8426 30.3368 24.9198 5.5692 11.5831 2.7022 42.2049
temp: 298.150 k
press: 1.00000 atm
elementType: 15 8 8 8 8 8 7 7 6 6 6 6 6 6 6 6 6 6 6 6 1 1 1 1 1 1 1 1 1 1 1 1 1 1 1 1 1 1 1
symmnumber: 1
zpe: 797768.6 jmol-1
zpe.correction: 0.303854 hartree
zpe.thermalcorrener: 0.327325 hartree
zpe.thermalcorrenthalpy: 0.328269 hartree
zpe.thermalcorrgfe: 0.247302 hartree
zpe.sumelectzpe: -1293.894992 hartree
zpe.sumelectthermal: -1293.871521 hartree
zpe.sumelectthermalent: -1293.870577 hartree
zpe.sumelectthermalfe: -1293.951544 hartree
dipole: -0.4127 -2.3671 -1.5956
dipole: 2.8844
quadrupole: -108.6750 -122.3187 -135.8174
quadrupole: -7.4983 -17.8551 -10.1396
quadrupole: 13.5953 -0.0483 -13.5470 -7.4983 -17.8551 -10.1396
hfenergy: -1294.1988463 hartree
pointgroup: C01 [X(C12H19N2O5P1)]
dipole: 0.1486684 0.9057575 -0.6673008 debye
polarizability: 229.3351308|0.6801285|188.8575618|16.8456594|-26.6390065|172.9255413 unknown
InChI: InChI=1S/C12H19N2O5P/c1-5-18-20(17,13-9(2)3)19-12-8-10(4)6-7-11(12)14(15)16/h6-9,13H,5H2,1-4H3
charge 0 multiplicity 1
39 atoms
P  1.923442 0.433477 -0.232544
O  0.304786 0.191907 0.521326
O  2.444735 -1.182162 -0.469331
O  1.864959 1.455176 -1.451925
O  -2.796311 -1.729419 2.2576
O  -0.739223 -2.21366 1.405648
N  2.930526 0.859698 1.0573
N  -1.829043 -1.517956 1.423811
C  3.249294 2.265364 1.424475
C  4.730725 2.344759 1.846685
C  2.298346 2.79456 2.523319
C  -0.939034 0.310134 -0.098763
C  -2.02164 -0.465302 0.411998
C  -1.202063 1.249271 -1.125992
C  -2.509852 1.432578 -1.633938
C  1.537366 -2.178151 -1.133617
C  -3.338256 -0.257455 -0.060359
C  -3.579242 0.67406 -1.082774
C  -2.766256 2.45752 -2.722033
C  2.361333 -3.45186 -1.28433
H  3.10847 2.863483 0.503804
H  3.200994 0.117096 1.706669
H  5.001884 3.386746 2.093229
H  4.917189 1.727569 2.746733
H  5.388999 1.989527 1.035897
H  1.244396 2.71112 2.204976
H  2.515422 3.855635 2.744769
H  2.420609 2.216327 3.458114
H  -0.363996 1.833753 -1.520146
H  0.659329 -2.326258 -0.480137
H  1.224209 -1.774938 -2.115865
H  -4.1470 -0.848411 0.378877
H  -4.597514 0.814219 -1.460564
H  -1.889071 2.576327 -3.380375
H  -3.634381 2.179512 -3.344331
H  -2.982077 3.449955 -2.280596
H  1.746913 -4.234668 -1.766297
H  3.25514 -3.273337 -1.905588
H  2.683595 -3.823391 -0.297125
