program: Gaussian 09
title: 000156738
version: EM64L-G09RevD.01
frameworkgroup: C1[X(C18H21Cl2O3P)]
method: RPBEPBE
basis: SDD
operation: Freq
keyword: #p
keyword: freq=noraman
keyword: PBEPBE/SDD
title: #p freq=noraman PBEPBE/SDD
converged: YES YES NO NO
title: Mulliken charges:
elementType: Cl Cl P O O O C C C C C C C C C C C C C C C C C C H H H H H H H H H H H H H H H H H H H H H
charge: 0.080592 0.066607 1.282511 -0.550485 -0.542213 -0.555576 -0.584159 0.218308 0.233892 0.339946 0.320776 -0.556723 -0.294887 -0.327429 -0.564276 -0.555728 0.466238 0.462470 -0.389994 -0.393336 -0.797622 -0.799612 -0.810878 -0.809842 0.269777 0.266007 0.260893 0.257388 0.288103 0.237307 0.238698 0.234603 0.236015 0.232337 0.248870 0.219848 0.221321 0.237979 0.238794 0.224539 0.226445 0.235130 0.235585 0.225350 0.226429
chargesum: 0.00000
title: Mulliken charges with hydrogens summed into heavy atoms:
elementType: Cl Cl P O O O C C C C C C C C C C C C C C C C C C
charge: 0.080592 0.066607 1.282511 -0.550485 -0.542213 -0.555576 -0.584159 0.218308 0.233892 0.339946 0.320776 0.239954 -0.037499 -0.039326 -0.326969 -0.317030 0.466238 0.462470 -0.155390 -0.157321 -0.096567 -0.101517 -0.124765 -0.122477
polarizability: 2.81681164e+02 4.31730139e+00 2.69926863e+02 -2.01222976e+01 2.90136673e+00 2.07841787e+02
1716.lowfreq: -11.6993 -2.2518 -0.0028 -0.0009 0.0014 3.1369 5.6929 12.4924 17.5090
frequency: -11.2111 12.0773 17.3430 22.0678 26.4639 31.5381 41.9258 52.2600 71.6741 89.2432 104.7785 120.3621 139.8028 149.2697 151.3340 163.5417 174.4362 198.9541 199.4347 201.6211 220.0638 246.6211 252.0509 269.6677 274.4082 280.8568 312.6797 319.2742 329.5928 343.3996 383.5923 391.5180 436.9263 438.1152 450.5118 456.3089 460.0563 478.8063 508.6247 551.8803 556.0347 559.9935 564.6809 602.1014 623.6710 634.1432 703.8937 713.7153 716.1543 720.0564 721.2899 801.8800 808.5849 819.0944 828.7914 883.3367 885.1187 927.5229 928.3003 947.9859 957.9169 981.3552 982.0600 1017.9014 1018.5928 1045.0332 1046.1731 1048.8008 1049.5364 1050.2410 1058.3745 1075.2225 1098.6658 1105.2227 1116.1105 1164.1177 1167.6880 1186.6022 1191.9350 1254.7511 1257.0587 1289.7733 1291.8239 1370.4435 1371.9067 1391.0045 1397.3763 1398.5589 1399.1286 1401.9940 1404.1018 1404.8881 1440.7355 1451.9817 1461.6112 1462.8690 1466.6479 1468.1555 1473.7885 1474.1532 1477.2908 1478.4817 1492.0966 1493.3761 1595.4640 1595.5587 1614.7227 1615.6105 2974.8172 2974.9099 2979.6902 2980.4917 3005.2541 3055.9014 3055.9680 3057.0296 3057.7594 3084.8276 3085.2338 3090.2957 3091.3063 3113.4460 3115.2056 3117.6025 3118.0001 3132.5290 3134.3070 3164.8031 3165.8782
redmass: 1.1023 3.2933 4.6205 5.6665 4.2617 6.9112 1.0104 5.7988 5.7827 5.7605 4.3491 1.0450 1.1089 5.1967 5.4878 9.1266 8.3951 3.3484 4.3119 2.9351 5.7661 6.9232 4.6657 1.1047 2.4499 3.0352 3.4220 5.7406 4.6915 4.9765 5.2800 6.6043 3.3680 3.2792 3.8501 5.4341 4.6003 4.4550 6.4669 4.4594 4.0586 4.0843 3.7413 6.9783 5.4402 7.6924 4.2639 4.6303 5.2608 3.3467 3.8907 6.2596 6.7118 1.3883 1.3503 1.3004 1.2948 3.3491 3.3881 1.3636 1.3470 1.4970 1.4944 1.4920 1.4935 1.5937 1.5671 6.2308 1.6556 1.5506 2.7791 1.5137 3.5730 3.0043 2.5619 1.5192 1.5871 1.7019 1.7864 2.4990 2.5815 1.6754 1.6310 6.7084 7.0752 1.1961 1.2890 1.2259 1.2338 1.2871 2.6693 2.5531 1.0417 1.0511 1.0776 1.0811 1.2368 1.3010 1.0564 1.0650 1.1813 1.2337 1.6876 1.9315 6.8961 7.0158 6.2579 6.3755 1.0388 1.0388 1.0371 1.0368 1.0342 1.0949 1.0950 1.0971 1.0970 1.0997 1.0997 1.0994 1.0995 1.1005 1.1010 1.0914 1.0914 1.0895 1.0897 1.0963 1.0959
irintensity: 0.4653 0.1614 0.1438 0.1221 0.0840 0.8271 0.4423 1.2301 0.3381 0.9401 0.9107 0.7839 0.8964 1.0500 0.5262 1.7951 1.2883 2.3033 10.1521 1.7855 1.6071 12.2492 6.5141 0.2028 0.4454 2.4759 0.0448 0.3616 0.9053 1.6927 10.9457 52.9502 23.1137 7.5754 4.2069 12.7351 14.7853 11.2468 34.0897 14.1671 8.7612 43.3393 29.6361 24.4967 81.5991 36.8411 0.3012 2.5931 2.4676 3.7538 1.0360 157.4211 258.5634 46.3023 58.2919 5.6421 1.8136 6.4442 6.3326 0.3369 2.3935 2.2190 1.4400 5.5189 4.4887 7.7569 8.7961 66.1023 17.2065 26.1214 46.3129 47.3271 168.4219 141.0732 2.8086 44.3860 21.5305 77.0871 73.8375 8.8575 10.6039 2.3313 2.0924 0.6089 0.7141 16.1186 27.1553 7.9094 9.6563 4.1506 5.1928 4.2005 5.3332 16.4459 9.6410 14.2260 6.3705 19.2677 10.7648 13.7979 29.7110 11.3477 118.9008 105.0047 0.4035 0.3309 2.3010 3.9239 38.4757 45.4237 13.0326 30.0704 1.9549 21.6174 20.1381 25.2477 10.3794 16.2015 16.4283 16.3971 29.7150 2.9579 3.8754 17.9400 23.8912 17.0315 14.4642 0.8303 2.3454
temp: 298.150 k
press: 1.00000 atm
elementType: 17 17 15 8 8 8 6 6 6 6 6 6 6 6 6 6 6 6 6 6 6 6 6 6 1 1 1 1 1 1 1 1 1 1 1 1 1 1 1 1 1 1 1 1 1
symmnumber: 1
zpe: 902771.4 jmol-1
zpe.correction: 0.343847 hartree
zpe.thermalcorrener: 0.370521 hartree
zpe.thermalcorrenthalpy: 0.371466 hartree
zpe.thermalcorrgfe: 0.282750 hartree
zpe.sumelectzpe: -2183.757847 hartree
zpe.sumelectthermal: -2183.731173 hartree
zpe.sumelectthermalent: -2183.730228 hartree
zpe.sumelectthermalfe: -2183.818944 hartree
dipole: -1.3179 -2.6617 3.4051
dipole: 4.5185
quadrupole: -151.6291 -154.1837 -161.1845
quadrupole: 0.5077 -2.4676 7.3175
quadrupole: 4.0366 1.4821 -5.5187 0.5077 -2.4676 7.3175
hfenergy: -2184.101694 hartree
pointgroup: C01 [X(C18H21Cl2O3P1)]
dipole: -0.9331821 -0.2559288 -1.4912754 debye
polarizability: 270.685098|3.6813778|279.2807241|11.5543145|20.2623809|209.4839911 unknown
InChI: InChI=1S/C18H21Cl2O3P/c1-12-6-8-16(14(3)10-12)22-24(21,18(5,19)20)23-17-9-7-13(2)11-15(17)4/h6-11H,1-5H3
charge 0 multiplicity 1
45 atoms
Cl 4.303326 -1.01676 1.397723
Cl 3.919632 1.912125 0.652331
P  1.520932 0.055706 0.738516
O  0.847451 1.038863 -0.540503
O  1.242936 -1.556238 0.149504
O  1.075686 0.398235 2.221913
C  3.381307 0.152963 0.266722
C  -0.150401 2.045956 -0.339937
C  -0.021232 -2.222058 0.244542
C  -1.278782 2.000111 -1.197641
C  -0.428866 -2.945998 -0.90485
C  3.657843 -0.176018 -1.188822
C  0.022776 3.060157 0.622048
C  -0.775542 -2.210491 1.435506
C  -2.230846 3.039808 -1.061436
C  -1.639496 -3.674056 -0.810266
C  -2.092408 4.081792 -0.109259
C  -2.434306 -3.683011 0.365041
C  -0.953736 4.071754 0.735122
C  -1.982239 -2.9410 1.484737
C  -1.449631 0.883558 -2.207361
C  0.412038 -2.945063 -2.165081
C  -3.127617 5.189432 -0.011712
C  -3.74448 -4.450471 0.413036
H  3.329838 -1.206664 -1.404474
H  3.106063 0.521556 -1.841666
H  4.73812 -0.086713 -1.391991
H  0.898901 3.050384 1.277722
H  -0.421873 -1.645179 2.303536
H  -3.111228 3.027721 -1.716639
H  -1.970308 -4.249578 -1.684281
H  -0.827556 4.858444 1.48796
H  -2.572849 -2.935983 2.408106
H  -0.605595 0.855615 -2.920799
H  -1.479822 -0.104768 -1.711175
H  -2.384399 1.010335 -2.779101
H  -0.083228 -3.511753 -2.971474
H  0.593658 -1.914288 -2.522161
H  1.404302 -3.397846 -1.982701
H  -4.127141 4.839342 -0.32443
H  -3.209395 5.576456 1.0192
H  -2.860141 6.044468 -0.662982
H  -4.581107 -3.837033 0.025282
H  -3.700737 -5.368647 -0.19924
H  -4.003549 -4.742065 1.445833
