program: Gaussian 09
title: 000156729
version: EM64L-G09RevD.01
frameworkgroup: C1[X(C16H15Cl4O3P)]
method: RPBEPBE
basis: SDD
operation: Freq
keyword: #p
keyword: freq=noraman
keyword: PBEPBE/SDD
title: #p freq=noraman PBEPBE/SDD
converged: YES YES NO NO
title: Mulliken charges:
elementType: Cl Cl Cl Cl P O O O C C C C C C C C C C C C C C C C H H H H H H H H H H H H H H H
charge: 0.083429 0.082659 -0.051841 -0.052063 1.292188 -0.542823 -0.542803 -0.569724 -0.589382 -0.551309 0.393700 0.393702 -0.504099 -0.506524 0.577893 0.578300 -0.397095 -0.398081 -0.313009 -0.313018 -0.178179 -0.178477 -0.792829 -0.792945 0.268307 0.268469 0.262607 0.290574 0.293325 0.258551 0.258511 0.259349 0.259290 0.232496 0.246730 0.247420 0.246651 0.232611 0.247442
chargesum: 0.00000
title: Mulliken charges with hydrogens summed into heavy atoms:
elementType: Cl Cl Cl Cl P O O O C C C C C C C C C C C C C C C C
charge: 0.083429 0.082659 -0.051841 -0.052063 1.292188 -0.542823 -0.542803 -0.569724 -0.589382 0.248073 0.393700 0.393702 -0.213526 -0.213199 0.577893 0.578300 -0.138544 -0.139570 -0.313009 -0.313018 0.081170 0.080813 -0.066184 -0.066241
polarizability: 2.55080448e+02 -3.83533720e-01 2.74460983e+02 -1.99543295e+00 -8.17171244e-01 2.22353541e+02
1716.lowfreq: -9.0332 -8.1415 -6.4152 -0.0028 -0.0025 -0.0022 3.6672 3.6802 13.7015
frequency: 2.6667 3.5744 13.3521 16.5840 35.3863 47.5040 75.9414 78.9228 88.8667 111.8443 120.2557 132.0468 145.1227 162.3641 177.9645 178.6301 204.6509 210.1456 212.3920 226.9319 238.0095 248.4735 260.7086 280.3755 313.9995 315.5018 322.2451 326.9221 353.9334 363.2112 404.1977 422.6742 432.5059 440.6390 442.6024 466.4987 502.5545 537.9693 539.2695 542.6764 553.4819 577.8107 586.4826 629.1621 656.6196 673.5786 702.6293 703.5496 708.2734 762.4662 769.9038 811.9063 815.1618 881.8691 886.3212 929.9823 935.9628 942.6801 944.0993 1001.2601 1002.3651 1023.5791 1024.2227 1041.0654 1046.7911 1048.1063 1059.5134 1078.8960 1113.4939 1124.1315 1125.1221 1143.1697 1151.6400 1225.7861 1228.2144 1275.2527 1278.5213 1369.0561 1369.4083 1390.6594 1392.6290 1395.1558 1402.6932 1404.2221 1444.0661 1454.1787 1457.0907 1458.6102 1461.6428 1463.2882 1476.9647 1478.5858 1582.7206 1584.4460 1600.4172 1601.6025 2987.4797 2987.9834 3006.4724 3066.6882 3067.0496 3101.8748 3101.9391 3115.3862 3115.6785 3162.8387 3163.4897 3164.4339 3165.4457 3183.4603 3184.0784
redmass: 9.3926 7.9658 5.6274 4.1413 9.2740 8.3754 12.0643 7.9068 7.4784 1.0498 1.0661 6.5908 8.1896 12.4299 5.9428 7.5564 4.3536 10.5243 3.7367 5.5472 4.2887 7.1394 6.0773 1.0806 3.2229 5.8216 6.5854 6.9836 8.5969 11.4077 6.0805 5.7952 4.8488 2.9255 2.9704 6.0651 8.6537 5.3658 6.3947 4.8410 5.3870 4.6769 4.7920 5.4477 7.1598 7.6662 3.3677 3.4447 4.4610 7.3267 8.8826 1.3652 1.3616 1.4365 1.4214 3.9004 3.7140 1.3647 1.3573 1.7324 1.8050 4.2033 3.7980 8.9080 1.5482 1.6269 2.7854 1.5022 2.4740 1.3602 1.3622 1.8930 1.8719 3.0128 3.0109 1.4205 1.4659 8.9313 8.9025 3.0707 3.0956 1.1890 1.2300 1.2295 1.0422 1.0501 2.2454 2.0988 1.0457 1.0451 1.2614 1.3091 6.3645 6.4307 7.7407 7.5085 1.0372 1.0372 1.0343 1.0972 1.0972 1.0998 1.0998 1.1006 1.1011 1.0893 1.0891 1.0925 1.0927 1.0978 1.0978
irintensity: 0.1113 0.0480 0.7313 0.1182 0.4041 1.4890 0.4332 0.7850 0.0361 0.6740 0.9079 0.8042 0.5589 1.0400 1.7264 4.1176 10.5057 4.0404 0.1613 2.2473 0.1347 10.4137 0.3699 0.0380 0.4158 0.6711 2.1951 1.1690 27.8954 65.5086 5.9822 10.7292 8.3704 6.1142 2.0449 28.1903 63.1023 0.0920 5.1226 10.5101 32.7054 0.0136 5.0669 25.1582 109.5234 141.7652 0.7857 1.4515 4.3575 106.8060 225.1941 50.5791 30.8239 27.4479 22.8872 140.9146 81.8630 4.2027 0.0808 21.6756 19.8791 87.4422 126.2372 51.3683 14.0582 8.3489 57.6588 59.9979 34.8550 21.4500 21.6074 167.8265 120.3052 53.1610 48.6380 18.9867 14.4050 0.8776 2.3849 54.5558 51.4279 33.4376 22.1234 26.8165 4.1729 18.6529 44.9061 43.6926 17.2707 13.8046 97.2922 132.7757 17.4837 9.1256 20.7026 26.1396 13.3769 15.6862 1.2967 12.8521 10.5494 4.7731 21.3674 1.7102 3.6288 1.3453 1.6229 0.7208 0.3560 1.5403 2.7149
temp: 298.150 k
press: 1.00000 atm
elementType: 17 17 17 17 15 8 8 8 6 6 6 6 6 6 6 6 6 6 6 6 6 6 6 6 1 1 1 1 1 1 1 1 1 1 1 1 1 1 1
symmnumber: 1
zpe: 710730.9 jmol-1
zpe.correction: 0.270703 hartree
zpe.thermalcorrener: 0.297088 hartree
zpe.thermalcorrenthalpy: 0.298032 hartree
zpe.thermalcorrgfe: 0.206105 hartree
zpe.sumelectzpe: -3024.078657 hartree
zpe.sumelectthermal: -3024.052272 hartree
zpe.sumelectthermalent: -3024.051328 hartree
zpe.sumelectthermalfe: -3024.143255 hartree
dipole: -0.0225 0.9625 -2.3382
dipole: 2.5287
quadrupole: -184.3509 -182.3810 -161.4629
quadrupole: 0.0340 -0.4245 -9.5716
quadrupole: -8.2860 -6.3160 14.6020 0.0340 -0.4245 -9.5716
hfenergy: -3024.3493597 hartree
pointgroup: C01 [X(C16H15Cl4O3P1)]
dipole: 0.4500008 -0.1167514 -0.8795493 debye
polarizability: 274.2581908|-0.0254771|255.0565355|3.3836411|-2.1563794|222.5802463 unknown
InChI: InChI=1S/C16H15Cl4O3P/c1-10-8-12(4-6-14(10)17)22-24(21,16(3,19)20)23-13-5-7-15(18)11(2)9-13/h4-9H,1-3H3
charge 0 multiplicity 1
39 atoms
Cl 4.310513 -1.448564 1.134533
Cl 4.378694 1.568935 0.723969
Cl -3.500073 4.787997 -1.032702
Cl -3.721569 -4.665613 0.176443
P  1.77471 0.045393 0.398336
O  1.394958 1.280139 -0.774422
O  1.337147 -1.440036 -0.404536
O  1.22495 0.258348 1.872497
C  3.665057 -0.03998 0.082691
C  4.033306 -0.245574 -1.375003
C  0.210287 2.07583 -0.765557
C  0.113202 -2.146805 -0.20859
C  -0.292125 2.662854 0.415907
C  -0.453812 -2.335075 1.070453
C  -1.436831 3.499111 0.369083
C  -1.637751 -3.101358 1.222525
C  -0.395204 2.296068 -2.019086
C  -0.464683 -2.706541 -1.366013
C  -2.025717 3.714169 -0.901724
C  -2.198576 -3.661402 0.048008
C  -1.526836 3.135646 -2.084161
C  -1.635291 -3.481502 -1.229512
C  -1.986219 4.127582 1.632146
C  -2.255579 -3.303994 2.589741
H  3.599069 -1.190665 -1.742066
H  3.644627 0.589828 -1.981332
H  5.130641 -0.286947 -1.475857
H  0.195083 2.466061 1.375537
H  0.014262 -1.882822 1.949896
H  0.017211 1.826458 -2.915973
H  -0.001247 -2.543072 -2.342517
H  -2.016659 3.331823 -3.041821
H  -2.105087 -3.934484 -2.106809
H  -1.390435 3.831675 2.510744
H  -1.98393 5.230803 1.56231
H  -3.035197 3.823925 1.803381
H  -2.316923 -4.377884 2.844388
H  -1.666165 -2.792994 3.368135
H  -3.288711 -2.912134 2.620859
