program: Gaussian 09
title: 000001316
version: EM64L-G09RevD.01
frameworkgroup: C1[X(C12H19N2)]
method: RPBEPBE
basis: SDD
operation: Freq
keyword: #p
keyword: freq=noraman
keyword: PBEPBE/SDD
title: #p freq=noraman PBEPBE/SDD
converged: YES YES NO NO
title: Mulliken charges:
elementType: N N C C C C C C C C C C C C H H H H H H H H H H H H H H H H H H H
charge: -0.096046 -0.181656 -0.361791 -0.352364 -0.437544 -0.434504 -0.537487 -0.557989 0.473717 -0.366548 -0.375102 -0.222485 -0.209510 -0.241318 0.263715 0.276536 0.277380 0.264800 0.281814 0.222997 0.239158 0.272425 0.265443 0.269341 0.265255 0.277985 0.265290 0.265622 0.237215 0.223600 0.240739 0.242218 0.249096
chargesum: 1.00000
title: Mulliken charges with hydrogens summed into heavy atoms:
elementType: N N C C C C C C C C C C C C
charge: -0.096046 -0.181656 0.178460 0.189815 0.067266 0.077079 0.262552 0.250907 0.473717 -0.129333 -0.151502 0.018254 0.032709 0.007778
polarizability: 1.93485544e+02 -2.64314878e-01 1.30974119e+02 9.84887589e-01 -3.38624109e+00 8.91319314e+01
1716.lowfreq: -21.1764 -10.7232 -0.0007 -0.0004 -0.0003 10.6793 38.7094 54.2907 106.8294
frequency: 37.5033 54.1665 106.7840 155.7847 168.2260 229.0214 238.3318 252.5103 273.8038 310.7955 356.9465 387.9593 406.3235 409.3782 437.7439 444.1298 481.4680 515.4591 524.2492 613.0320 627.8084 678.3273 697.2170 715.7361 763.7842 791.0433 825.6738 880.8274 886.1080 900.6735 919.9729 952.2301 969.4876 984.3942 997.5287 1002.0292 1019.9760 1032.1907 1042.4538 1050.2190 1063.2909 1091.3400 1102.0369 1154.4643 1161.0922 1179.7746 1196.9065 1201.6965 1204.1176 1227.5746 1237.2495 1288.6679 1311.6751 1325.0069 1334.8541 1341.8044 1357.2565 1367.6534 1380.1341 1389.4357 1420.9470 1437.4529 1442.4824 1444.7947 1452.3742 1461.1412 1471.4202 1476.0659 1476.7691 1484.4911 1488.0994 1494.3265 1591.9951 1611.5467 2885.4979 2891.8882 3021.9796 3029.6253 3030.7576 3034.8550 3060.1662 3086.2162 3108.0527 3112.7443 3127.5403 3135.4986 3137.9294 3142.5730 3144.5548 3150.1593 3157.5724 3157.8189 3177.3860
redmass: 3.7465 3.3071 3.5985 2.7903 1.1510 2.1573 1.9944 1.7754 2.8235 2.1529 2.0754 2.5993 2.8492 2.5090 2.3760 2.4488 3.0478 4.1373 3.0629 6.1481 2.6181 3.5490 1.9447 3.6121 1.7597 1.8842 1.2663 3.1674 1.8305 1.4637 3.1992 2.8202 1.3986 5.2075 1.3538 1.9057 2.1937 2.0134 1.7437 1.9452 1.7017 1.6109 1.3171 1.9334 2.0148 1.0494 1.1301 1.3115 1.6515 2.1429 1.7892 1.3205 1.4348 1.4403 1.6990 1.2960 1.3994 1.3288 2.2770 2.2353 1.1553 1.1196 1.1193 2.1175 1.1012 1.0640 1.0742 1.0854 1.0805 1.1093 1.9835 1.0732 6.2207 6.0781 1.0725 1.0725 1.0327 1.0418 1.0522 1.0570 1.0879 1.0874 1.1077 1.1085 1.0881 1.0867 1.1055 1.1049 1.1050 1.0910 1.0960 1.1039 1.1013
irintensity: 0.8395 1.2724 1.3731 3.7075 0.4177 1.7086 4.3266 0.8011 0.5363 0.1904 6.1540 0.1015 0.8966 0.7528 0.2040 0.9213 0.9533 4.3251 11.9739 0.1746 1.9363 1.7083 36.3558 10.3455 73.1918 7.2454 0.0261 17.6573 3.6026 5.9051 80.2243 12.7534 0.6576 0.1087 1.7167 12.4247 12.0358 6.4920 2.1408 2.7186 6.0873 7.4628 0.4689 30.2911 6.8168 0.3771 1.6165 1.0214 6.5684 63.1396 82.5320 17.2089 7.6693 2.1166 12.5312 1.9335 0.0638 1.5604 10.7973 15.3926 21.9962 3.5385 2.6106 6.4930 23.0959 3.7597 25.9533 29.5559 62.9974 69.8554 58.0244 36.6816 10.1815 68.5268 31.7499 129.4483 2.4399 5.0422 7.0261 13.8670 5.1620 3.8979 3.5404 10.6292 13.9872 9.9055 0.3509 5.6297 4.8155 6.7135 22.9523 3.0702 7.3671
temp: 298.150 k
press: 1.00000 atm
elementType: 7 7 6 6 6 6 6 6 6 6 6 6 6 6 1 1 1 1 1 1 1 1 1 1 1 1 1 1 1 1 1 1 1
symmnumber: 1
zpe: 768026.8 jmol-1
zpe.correction: 0.292526 hartree
zpe.thermalcorrener: 0.305661 hartree
zpe.thermalcorrenthalpy: 0.306605 hartree
zpe.thermalcorrgfe: 0.253170 hartree
zpe.sumelectzpe: -576.845265 hartree
zpe.sumelectthermal: -576.832130 hartree
zpe.sumelectthermalent: -576.831186 hartree
zpe.sumelectthermalfe: -576.884621 hartree
dipole: 10.8648 -0.0771 0.3425
dipole: 10.8705
quadrupole: -29.8253 -69.2921 -80.9184
quadrupole: 0.2211 -0.6146 -0.1657
quadrupole: 30.1866 -9.2802 -20.9064 0.2211 -0.6146 -0.1657
hfenergy: -577.1377914 hartree
pointgroup: C01 [X(C12H19N2)]
dipole: 4.2736192 -0.0419755 0.1592381 debye
polarizability: 193.4688576|-0.3621485|131.2432255|1.6239852|-0.3887018|88.8795115 unknown
InChI: InChI=1S/C12H19N2/c1-14(2)10-8-13(9-11-14)12-6-4-3-5-7-12/h3-7H,8-11H2,1-2H3
charge 1 multiplicity 1
33 atoms
N  3.011941 0.02508 -0.021977
N  0.065614 0.032517 -0.103379
C  2.180073 -0.93695 -0.905523
C  2.160318 1.287705 0.266196
C  0.788184 -1.224951 -0.321393
C  0.775759 0.932521 0.822371
C  4.267774 0.438015 -0.785055
C  3.432504 -0.655492 1.277797
C  -1.377345 0.009834 -0.058169
C  -2.10052 -1.207365 0.046231
C  -2.094606 1.232848 -0.154347
C  -3.513985 -1.195747 0.049097
C  -3.503735 1.235639 -0.130788
C  -4.223652 0.02147 -0.031992
H  2.771186 -1.861708 -1.022326
H  2.074071 -0.437581 -1.883106
H  2.051459 1.810343 -0.698917
H  2.738261 1.913479 0.96772
H  0.253601 -1.827478 -1.076053
H  0.86423 -1.856046 0.597064
H  0.85386 0.50078 1.849182
H  0.216755 1.875485 0.93064
H  4.865805 -0.458972 -1.009018
H  3.974147 0.93334 -1.722807
H  4.854918 1.132561 -0.164303
H  2.545364 -0.96606 1.844681
H  4.043802 -1.538226 1.034701
H  4.023816 0.054873 1.875963
H  -1.582521 -2.167317 0.143931
H  -1.559048 2.18047 -0.284641
H  -4.058023 -2.142887 0.128613
H  -4.041115 2.186483 -0.210703
H  -5.317794 0.026539 -0.023288
