program: Gaussian 09
title: 000156720
version: EM64L-G09RevD.01
frameworkgroup: C1[X(C14H11Cl2N2O7P)]
method: RPBEPBE
basis: SDD
operation: Freq
keyword: #p
keyword: freq=noraman
keyword: PBEPBE/SDD
title: #p freq=noraman PBEPBE/SDD
converged: YES YES NO NO
title: Mulliken charges:
elementType: Cl Cl P O O O O O O O N N C C C C C C C C C C C C C C H H H H H H H H H H H
charge: 0.086830 0.060187 1.297359 -0.507815 -0.517664 -0.547250 -0.191098 -0.202827 -0.190049 -0.200780 0.025849 0.018495 -0.579462 -0.565997 0.297420 0.334314 0.278350 0.231742 -0.301244 -0.279264 -0.325994 -0.327977 -0.201203 -0.218623 -0.211206 -0.223000 0.321559 0.256156 0.258147 0.268198 0.305440 0.288018 0.283774 0.247033 0.241129 0.248089 0.243366
chargesum: 0.00000
title: Mulliken charges with hydrogens summed into heavy atoms:
elementType: Cl Cl P O O O O O O O N N C C C C C C C C C C C C C C
charge: 0.086830 0.060187 1.297359 -0.507815 -0.517664 -0.547250 -0.191098 -0.202827 -0.190049 -0.200780 0.025849 0.018495 -0.579462 0.269864 0.297420 0.334314 0.278350 0.231742 -0.033046 0.026176 -0.037976 -0.044203 0.045830 0.022506 0.036883 0.020365
polarizability: 3.22266594e+02 2.21077587e+01 2.42696723e+02 5.71275203e+00 2.25553188e+01 1.84827922e+02
1716.lowfreq: -7.4327 -4.7729 0.0028 0.0030 0.0031 4.9805 13.3458 15.3077 25.2817
frequency: 13.1922 15.2436 25.1890 43.1187 47.5282 53.2293 61.6411 89.2332 93.0020 102.3103 118.0960 132.5529 152.8769 167.5179 171.3585 184.8834 196.3862 221.8004 240.9497 246.5225 262.2775 282.8263 292.9015 314.6704 323.3172 337.2418 366.0554 372.8986 395.5195 402.1423 422.7060 436.3129 472.6310 479.8042 500.2106 522.3689 530.0385 557.9075 569.8431 613.9199 618.8816 631.5856 649.6418 663.7946 666.6228 677.2781 697.6841 730.6639 730.9272 771.5747 777.9319 778.9870 784.2873 853.0149 865.5857 877.6537 885.5194 965.0004 973.4600 992.0202 998.7115 1033.3247 1036.8777 1053.8038 1058.8640 1066.2165 1068.9596 1077.1579 1110.7392 1136.7696 1145.3897 1169.1447 1176.7593 1188.4583 1208.4840 1225.3782 1227.7092 1260.5018 1277.2018 1360.5467 1363.1938 1386.8955 1388.4252 1401.2662 1437.0035 1438.0132 1444.1938 1460.4135 1461.0882 1470.2478 1579.1217 1584.7886 1600.4593 1602.3108 2999.1938 3105.1911 3111.4229 3148.9748 3150.9069 3165.1000 3167.0097 3175.7503 3179.2877 3186.5007 3188.4990
redmass: 9.7853 8.5301 7.8173 8.9068 11.8219 12.4658 9.5587 8.2125 11.5579 9.0477 4.9071 6.4190 11.0414 9.9941 7.2356 10.2623 13.8487 6.4173 8.0404 7.4364 7.4353 5.1778 1.2302 6.9534 2.8232 7.4407 10.4797 10.1386 7.3903 5.6196 4.5662 5.3378 8.1154 10.4592 4.5941 5.2899 5.8159 5.3427 6.4236 8.0130 5.9014 7.0177 7.8958 4.9550 5.6282 8.7247 4.6390 4.0893 4.0801 4.8864 1.9837 4.4782 1.3731 7.2350 7.1121 1.4337 1.4248 1.3629 1.3676 1.3367 1.3453 2.4843 2.9311 5.8083 3.9636 3.4035 3.2876 1.5242 2.3584 1.8624 1.7831 1.3548 1.1405 2.1769 4.7429 6.1700 4.4702 1.5842 1.5578 8.0636 7.9850 7.4564 7.2346 1.1822 2.5061 2.5698 1.0420 1.2143 1.9050 2.4331 7.1247 7.1441 6.5112 6.4715 1.0345 1.1006 1.1007 1.0872 1.0873 1.0910 1.0909 1.0960 1.0951 1.0994 1.0996
irintensity: 0.2230 1.5562 1.3853 4.2943 1.6672 0.3230 1.5624 1.1622 3.1839 4.8967 1.7970 0.8126 0.5806 2.7469 1.7410 1.9535 0.5990 7.3747 4.9133 3.5429 4.1902 3.0442 3.1265 1.1544 0.7234 2.7254 5.5286 35.4107 35.8239 4.9928 12.8922 7.3862 24.8279 89.6782 11.4420 10.1196 7.7204 0.3428 7.4435 44.9469 5.2461 65.3785 37.0304 12.0381 20.3801 110.2839 7.4868 21.3293 12.1235 17.3880 99.5290 60.3529 74.6348 181.5939 154.0390 8.7513 0.5374 5.4288 2.9874 0.6510 0.6770 5.9574 13.4288 79.2810 31.0394 82.8228 36.9202 70.0437 24.3759 17.2018 3.9635 34.9589 41.6920 99.5417 319.3109 281.0911 114.0350 29.2951 36.0682 139.2149 157.4950 17.9087 4.6562 32.1355 20.2190 30.5469 1.5301 39.0965 186.3669 161.7128 29.3284 31.5279 117.4822 26.2032 17.6848 12.1821 3.0494 4.8915 3.6292 7.0667 8.3155 2.5807 0.5108 8.3055 9.1290
temp: 298.150 k
press: 1.00000 atm
elementType: 17 17 15 8 8 8 8 8 8 8 7 7 6 6 6 6 6 6 6 6 6 6 6 6 6 6 1 1 1 1 1 1 1 1 1 1 1
symmnumber: 1
zpe: 625052.4 jmol-1
zpe.correction: 0.238070 hartree
zpe.thermalcorrener: 0.263439 hartree
zpe.thermalcorrenthalpy: 0.264383 hartree
zpe.thermalcorrgfe: 0.179204 hartree
zpe.sumelectzpe: -2435.426562 hartree
zpe.sumelectthermal: -2435.401193 hartree
zpe.sumelectthermalent: -2435.400249 hartree
zpe.sumelectthermalfe: -2435.485428 hartree
dipole: 4.3803 -0.0851 -1.3000
dipole: 4.5699
quadrupole: -136.1698 -172.8313 -180.0051
quadrupole: 1.5525 21.7071 10.8495
quadrupole: 26.8322 -9.8292 -17.0030 1.5525 21.7071 10.8495
hfenergy: -2435.664632 hartree
pointgroup: C01 [X(C14H11Cl2N2O7P1)]
dipole: -0.0443937 1.7641034 -0.3443873 debye
polarizability: 252.5661652|-27.5695347|316.3665541|-15.8870347|13.5435733|180.858519 unknown
InChI: InChI=1S/C14H11Cl2N2O7P/c1-14(15,16)26(23,24-12-8-4-2-6-10(12)17(19)20)25-13-9-5-3-7-11(13)18(21)22/h2-9H,1H3
charge 0 multiplicity 1
37 atoms
Cl -3.227488 -1.134248 -2.01298
Cl -3.605061 1.696847 -0.952763
P  -0.860614 0.372362 -0.869541
O  -0.620227 1.389352 0.556636
O  -0.363272 -1.179505 -0.272471
O  -0.33599 0.927431 -2.255813
O  3.618981 1.903335 0.427697
O  0.781771 -4.32296 2.067654
O  1.885086 0.561103 -0.168134
O  -1.041995 -3.133868 1.407034
N  2.363961 1.700245 0.216832
N  0.159057 -3.569045 1.220766
C  -2.747014 0.049115 -0.643507
C  -3.116554 -0.513036 0.713607
C  0.023249 2.636953 0.53541
C  0.588888 -2.063467 -0.787498
C  1.431797 2.823383 0.421041
C  0.865539 -3.240597 -0.035532
C  -0.795549 3.767364 0.7594
C  1.286933 -1.834325 -1.995986
C  1.996798 4.117209 0.528565
C  1.847367 -4.158157 -0.478251
C  -0.231319 5.054184 0.86035
C  2.243236 -2.767882 -2.440349
C  1.168982 5.232309 0.740492
C  2.532011 -3.928994 -1.68383
H  -2.585968 -1.465542 0.886135
H  -2.833867 0.19863 1.508339
H  -4.205345 -0.685168 0.755039
H  -1.873523 3.606703 0.850915
H  1.087111 -0.924893 -2.569036
H  3.08263 4.21396 0.445568
H  2.04637 -5.03765 0.14004
H  -0.883934 5.916884 1.02827
H  2.77311 -2.578873 -3.379576
H  1.608167 6.231472 0.813763
H  3.282174 -4.64543 -2.030886
