program: Gaussian 09
title: 000156755
version: EM64L-G09RevD.01
frameworkgroup: C1[X(C23H19ClF3NO3)]
method: RPBEPBE
basis: SDD
operation: Freq
keyword: #p
keyword: freq=noraman
keyword: PBEPBE/SDD
title: #p freq=noraman PBEPBE/SDD
converged: YES YES NO NO
title: Mulliken charges:
elementType: Cl F F F O O O N C C C C C C C C C C C C C C C C C C C C C C C H H H H H H H H H H H H H H H H H H H
charge: -0.016882 -0.151403 -0.153791 -0.149391 -0.287027 -0.254511 -0.310585 0.018010 0.312876 -0.277172 -0.387815 -0.733488 -0.718509 0.031145 0.306780 -0.292222 -0.190085 0.365285 0.494940 -0.166773 -0.479474 -0.430575 0.340867 -0.186615 -0.388153 0.336883 -0.380038 -0.353763 -0.192296 -0.206225 -0.253556 0.266711 0.286617 0.222828 0.257587 0.223167 0.229222 0.219376 0.229621 0.285927 0.278205 0.292927 0.238733 0.235848 0.265185 0.259415 0.264403 0.231376 0.235550 0.230865
chargesum: 0.00000
title: Mulliken charges with hydrogens summed into heavy atoms:
elementType: Cl F F F O O O N C C C C C C C C C C C C C C C C C C C C C C C
charge: -0.016882 -0.151403 -0.153791 -0.149391 -0.287027 -0.254511 -0.310585 0.018010 0.312876 -0.010461 -0.101199 -0.029907 -0.040290 0.317072 0.306780 -0.292222 0.088121 0.365285 0.494940 -0.166773 -0.186546 -0.191842 0.340867 0.049233 -0.122968 0.336883 -0.120623 -0.089361 0.039080 0.029325 -0.022691
polarizability: 2.66539406e+02 -1.43386379e+01 2.89424693e+02 -1.81287260e+01 2.14868259e+01 2.68147354e+02
1716.lowfreq: -5.0898 -0.7470 -0.0021 -0.0017 -0.0013 4.4587 6.9771 10.7882 19.5023
frequency: 3.3918 10.3950 19.4860 23.6711 26.6454 34.8020 41.6235 45.8984 60.1558 66.3758 79.9231 85.8896 94.3136 133.9172 145.5145 165.9002 173.0804 184.5870 189.1507 196.8861 212.2827 223.9949 228.0156 244.4635 252.9018 292.3812 300.4824 309.5035 325.6067 334.8189 352.1311 369.4599 387.4362 403.9437 409.6762 415.8863 447.3970 450.0064 459.5288 476.6554 486.9112 493.0398 544.9615 561.5172 570.0193 578.1938 591.7716 610.3271 625.1373 633.9489 638.5421 647.9188 690.3724 695.9890 711.2317 731.6177 746.3280 768.1357 785.4553 795.4133 814.8534 824.9590 836.1084 878.3665 896.8797 897.4704 902.6620 909.9840 917.9341 937.6218 954.1392 961.8463 969.8089 973.0018 979.3244 986.4754 987.2642 990.1901 994.3271 998.1217 1000.1254 1018.9291 1025.6811 1046.7027 1058.4990 1077.2797 1084.7710 1114.4166 1125.8842 1135.5492 1166.7894 1173.4644 1175.3262 1181.4087 1193.2308 1215.3583 1230.0884 1232.4149 1258.5701 1272.2646 1279.0280 1307.3243 1314.0039 1316.4320 1364.0311 1380.8265 1392.1239 1393.0049 1399.0980 1413.1806 1439.1998 1443.5241 1463.8015 1467.6173 1470.2165 1476.8445 1483.4157 1495.0554 1593.9834 1596.6494 1605.6724 1613.7788 1627.7413 1662.9296 2203.3952 2978.4547 2991.3095 3016.6065 3073.1355 3077.3394 3079.0517 3114.3881 3125.5137 3131.4018 3136.7537 3137.6505 3140.7121 3153.8819 3156.1705 3156.6911 3158.9288 3163.8134 3174.9427 3177.5994
redmass: 7.0483 9.6916 6.2139 9.9964 6.4072 5.2727 5.7570 13.3497 6.1975 6.6088 5.2649 7.4610 6.9251 7.5044 4.6996 3.5516 2.7424 7.1523 2.6749 1.8628 4.4210 2.1758 2.0195 7.0671 4.9631 6.1576 5.9669 5.6653 6.0237 10.1447 5.1323 3.1814 5.2994 5.6454 2.9519 9.2997 3.8224 4.8625 3.9995 3.4752 12.5965 3.0958 6.1102 7.7831 6.0197 8.6643 9.0920 6.3622 5.7573 4.3707 6.2550 8.1969 2.3936 2.0922 6.2342 4.5658 5.6123 1.7819 4.3558 1.6718 4.1400 5.4066 1.2704 5.1897 3.6970 1.7279 1.4537 1.4835 1.5892 3.1501 2.5039 1.3698 1.3878 1.7061 1.3558 5.3491 5.5748 1.3537 3.1348 4.9557 1.8168 2.1012 6.5992 2.5840 1.4075 1.5074 1.6194 1.8918 1.7585 1.8667 1.2440 1.1592 1.1371 3.5878 2.0610 3.0838 2.2795 2.3470 1.6828 1.4245 1.4009 1.3541 2.2549 1.3802 1.6397 8.0718 5.4743 1.4591 1.7845 1.4182 2.5127 2.4794 1.0537 1.0508 2.2904 2.5224 1.1000 1.0641 6.2720 6.6114 6.6001 6.6114 10.0508 8.3202 12.5789 1.0357 1.0379 1.0829 1.0996 1.0989 1.1000 1.0979 1.0901 1.0852 1.0876 1.0880 1.0889 1.0934 1.0901 1.0927 1.0923 1.0970 1.0999 1.0982
irintensity: 0.2800 0.9251 0.7060 0.4102 0.4073 0.2827 1.3716 0.1063 0.7255 0.8044 0.5947 2.4915 2.8209 1.2669 1.0212 2.1313 0.3405 2.2799 1.4522 0.1741 1.9719 0.9080 0.6546 0.8511 6.8558 7.2580 7.5941 5.4848 4.7410 0.6064 1.7018 5.7995 2.5126 3.6500 0.3257 0.5859 6.9848 2.4193 5.8421 18.3195 1.4250 2.3391 4.4554 0.4128 1.9581 7.4013 14.7511 0.3645 4.8331 2.0761 7.7172 13.0437 35.2691 24.7653 2.2100 13.3837 11.7743 90.4812 87.2337 24.8855 35.8547 46.1987 1.6263 5.3301 78.4564 29.2456 2.2992 9.3088 108.2368 9.4907 38.9964 4.1764 0.0760 7.7758 1.2377 3.3930 4.8692 0.1822 82.2695 278.0639 21.8093 11.3133 137.1707 248.7068 84.4491 15.0349 4.0471 169.0933 21.3398 7.7787 48.9419 31.6962 2.6165 48.3010 92.5188 229.6479 90.1641 188.3978 39.2027 54.2554 10.0335 0.4524 0.7373 4.4267 61.9342 5.5128 4.7961 53.9596 101.6473 26.0885 33.8942 37.0870 5.2526 13.2291 145.5057 14.8085 11.1511 8.6667 33.6290 106.7008 26.7108 6.4007 72.0374 74.9551 1.4527 25.1345 35.1902 9.7237 0.8330 37.6308 27.7451 6.8289 7.6406 1.4191 14.7434 4.2770 5.0495 27.6524 0.8352 9.7823 1.4808 11.0227 8.6036 6.7517
temp: 298.150 k
press: 1.00000 atm
elementType: 17 9 9 9 8 8 8 7 6 6 6 6 6 6 6 6 6 6 6 6 6 6 6 6 6 6 6 6 6 6 6 1 1 1 1 1 1 1 1 1 1 1 1 1 1 1 1 1 1 1
symmnumber: 1
zpe: 953007.0 jmol-1
zpe.correction: 0.362981 hartree
zpe.thermalcorrener: 0.393057 hartree
zpe.thermalcorrenthalpy: 0.394001 hartree
zpe.thermalcorrgfe: 0.295067 hartree
zpe.sumelectzpe: -1925.564626 hartree
zpe.sumelectthermal: -1925.534551 hartree
zpe.sumelectthermalent: -1925.533606 hartree
zpe.sumelectthermalfe: -1925.632540 hartree
dipole: 2.4114 1.5491 -2.3640
dipole: 3.7152
quadrupole: -202.8782 -189.8955 -176.0770
quadrupole: 23.7370 -23.2291 11.8845
quadrupole: -13.2613 -0.2786 13.5399 23.7370 -23.2291 11.8845
hfenergy: -1925.9276076 hartree
pointgroup: C01 [X(C23H19Cl1F3N1O3)]
dipole: 1.0927398 0.7623437 -0.6010602 debye
polarizability: 263.9039413|2.2583637|251.5875146|12.0023036|-10.4544678|308.619998 unknown
InChI: InChI=1S/C23H19ClF3NO3/c1-22(2)17(12-19(24)23(25,26)27)20(22)21(29)31-18(13-28)14-7-6-10-16(11-14)30-15-8-4-3-5-9-15/h3-12,17-18,20H,1-2H3
charge 0 multiplicity 1
50 atoms
Cl 1.154162 -0.887704 -4.112423
F  0.220944 -3.45498 -2.511701
F  2.092412 -3.571729 -1.228628
F  2.239575 -3.75788 -3.487173
O  1.027953 1.712041 1.6906
O  2.33244 -0.211936 1.443721
O  -3.781684 -0.144529 0.807325
N  -0.092605 3.282082 4.487581
C  3.660929 1.379721 -0.974316
C  2.4445 0.656978 -1.604485
C  2.269861 1.528632 -0.303881
C  4.774878 0.580077 -0.30266
C  4.154661 2.617687 -1.724882
C  2.281998 -0.805169 -1.549335
C  1.927459 0.885144 0.987386
C  1.755352 -1.572263 -2.534999
C  0.545478 1.160322 3.001194
C  1.582556 -3.060324 -2.444086
C  -0.631562 0.205976 2.806915
C  0.196985 2.346848 3.807443
C  -1.628813 0.498049 1.849278
C  -0.724105 -0.950949 3.614278
C  -2.717018 -0.390408 1.702752
C  -1.836849 -1.810927 3.474681
C  -2.837279 -1.538004 2.519038
C  -3.530694 0.463969 -0.455291
C  -4.495543 1.386334 -0.911445
C  -2.43357 0.085888 -1.263753
C  -4.352462 1.948709 -2.19968
C  -2.302423 0.658595 -2.548496
C  -3.256401 1.591488 -3.019893
H  2.029949 1.132824 -2.499531
H  1.754649 2.480332 -0.457478
H  5.379584 1.248823 0.336856
H  4.399881 -0.237373 0.331894
H  5.44345 0.15236 -1.071916
H  4.880429 2.325897 -2.50611
H  3.32894 3.165364 -2.214125
H  4.661126 3.313455 -1.030911
H  2.596312 -1.322623 -0.633367
H  1.384045 0.618306 3.480025
H  -1.555301 1.396638 1.228778
H  0.063424 -1.182064 4.339963
H  -1.916348 -2.706078 4.099838
H  -3.700672 -2.195889 2.384919
H  -5.336364 1.644323 -0.26083
H  -1.709771 -0.654398 -0.907072
H  -5.098262 2.665474 -2.560297
H  -1.463239 0.356737 -3.184963
H  -3.152166 2.027154 -4.019242
