program: Gaussian 09
title: 000156711
version: EM64L-G09RevD.01
frameworkgroup: C1[X(C16H16O5)]
method: RPBEPBE
basis: SDD
operation: Freq
keyword: #pfreq=noraman
keyword: PBEPBE/SDD
title: #p freq=noraman PBEPBE/SDD
converged: YES YES NO NO
title: Mulliken charges:
elementType: O O O O O C C C C C C C C C C C C C C C C H H H H H H H H H H H H H H H H
charge: -0.292699 -0.268028 -0.215020 -0.226755 -0.197941 -0.243992 0.351821 0.281326 0.041885 -0.029801 0.076326 -0.650734 0.490345 0.031667 -0.688952 -0.692023 -0.280792 -0.313608 0.114736 -0.513986 -0.507621 0.244967 0.254876 0.231313 0.221056 0.219802 0.222332 0.223152 0.220245 0.247083 0.252085 0.239062 0.224012 0.225607 0.234877 0.243832 0.229544
chargesum: 0.00000
title: Mulliken charges with hydrogens summed into heavy atoms:
elementType: O O O O O C C C C C C C C C C C C C C C C
charge: -0.292699 -0.268028 -0.215020 -0.226755 -0.197941 0.000976 0.351821 0.281326 0.041885 -0.029801 0.076326 -0.395858 0.490345 0.031667 -0.016782 -0.026293 -0.033709 -0.061524 0.114736 0.174694 0.200633
polarizability: 3.23617743e+02 7.40177903e+00 2.08147273e+02 4.04253832e-01 3.46284010e+00 1.03704811e+02
1716.lowfreq: -0.0006 -0.0005 0.0004 1.8143 4.2185 7.4756 30.8360 44.2960 49.9180
frequency: 30.8055 44.1249 49.8988 62.9425 75.4460 96.9382 100.5411 128.2940 130.5179 155.0242 168.6706 183.3810 195.8027 199.7415 209.5465 233.7611 249.8182 251.2584 280.2689 340.9299 350.4245 360.6918 386.1344 402.0846 418.8857 448.6173 486.6747 508.2405 524.8536 558.6861 581.2566 598.9005 638.2418 652.6684 683.3423 703.8106 719.2097 748.2719 754.4063 781.5424 814.5921 820.1565 869.3670 873.6681 895.7251 922.8000 925.5848 954.9382 975.3381 987.5822 1014.6941 1038.2338 1055.5168 1107.9907 1109.3515 1111.0807 1117.0959 1137.6719 1153.4613 1155.4718 1176.9348 1183.5581 1209.9827 1234.6157 1263.4581 1299.7790 1318.6815 1346.7236 1375.1505 1382.8967 1394.2987 1406.5980 1430.8209 1437.8126 1446.5201 1458.0538 1459.6186 1460.6663 1464.0457 1465.5694 1469.2327 1470.6593 1478.2576 1488.9956 1574.6973 1609.0549 1619.4091 1624.5477 1684.2994 2967.6191 2983.4779 2985.9347 2994.4171 3007.2883 3058.7912 3082.0419 3084.5967 3087.7945 3092.7001 3097.0098 3124.5916 3132.7103 3138.2170 3154.9721 3186.8655
redmass: 3.1158 2.9171 4.4458 3.3722 3.4291 4.3353 3.5164 3.5304 1.3944 3.3821 4.5509 2.7573 1.0398 1.6548 2.5552 1.2897 4.4768 3.1059 5.3781 4.4817 4.9353 6.8270 4.7471 3.6458 4.4189 5.9476 7.0670 6.0250 6.3437 4.1276 5.2744 5.5973 6.3000 5.2133 5.5646 7.8538 7.8342 6.8144 4.7716 6.6981 4.9417 1.6531 1.6892 2.9358 6.9869 1.2473 6.1630 1.4713 6.4704 1.3218 2.5116 3.6225 3.7020 1.8672 1.5197 1.2516 4.1291 1.7534 1.4293 1.9904 2.1699 1.8521 1.9580 2.4408 3.2507 1.3211 1.6550 2.7001 1.1907 2.3495 1.2381 3.2802 7.0018 1.3694 1.4376 1.3520 2.1169 1.0813 1.0510 1.0457 1.0513 1.0551 1.0462 1.0657 9.4087 7.9655 8.5375 9.0162 10.7187 1.0313 1.0346 1.0350 1.0301 1.0841 1.1041 1.1006 1.1006 1.1002 1.1001 1.1048 1.1015 1.0904 1.1037 1.0925 1.0956
irintensity: 3.2719 4.7997 0.6645 4.3747 5.2524 0.9517 0.1183 1.2863 0.1695 0.9736 2.7183 2.9065 0.0193 1.5529 0.7624 2.2589 0.2376 1.0046 6.8989 3.4786 1.7003 1.8216 0.4890 9.0099 0.3089 3.1883 6.9214 0.8555 6.8130 6.3507 1.6414 3.9717 0.0535 1.4281 2.0238 22.5626 14.0284 24.3716 8.8732 11.2841 0.7603 8.3619 58.6760 8.4644 9.7884 0.9156 18.8953 0.1346 131.5258 0.3133 92.0501 96.3061 159.3083 3.3085 2.1665 0.0902 94.4727 29.2798 17.3526 9.4654 15.5243 22.0390 13.9771 18.7896 47.2018 1.6913 50.4433 115.0429 16.7342 99.0724 34.6433 28.3711 12.4329 6.6680 19.7582 7.4788 9.5939 32.6024 22.7986 1.7920 1.8187 9.1061 17.8617 15.3676 89.6505 44.4863 36.4095 58.2054 611.4455 57.0017 31.2743 35.4609 45.6739 4.6346 41.3546 7.5563 30.0299 69.5778 39.2101 34.4510 27.1869 10.7638 19.7910 3.2938 3.4589
temp: 298.150 k
press: 1.00000 atm
elementType: 8 8 8 8 8 6 6 6 6 6 6 6 6 6 6 6 6 6 6 6 6 1 1 1 1 1 1 1 1 1 1 1 1 1 1 1 1
symmnumber: 1
zpe: 747360.6 jmol-1
zpe.correction: 0.284655 hartree
zpe.thermalcorrener: 0.305250 hartree
zpe.thermalcorrenthalpy: 0.306195 hartree
zpe.thermalcorrgfe: 0.234854 hartree
zpe.sumelectzpe: -993.843593 hartree
zpe.sumelectthermal: -993.822997 hartree
zpe.sumelectthermalent: -993.822053 hartree
zpe.sumelectthermalfe: -993.893394 hartree
dipole: -6.7931 3.2914 -1.2803
dipole: 7.6563
quadrupole: -142.9174 -105.8160 -123.5162
quadrupole: 19.3700 5.8261 -3.8357
quadrupole: -18.8342 18.2672 0.5670 19.3700 5.8261 -3.8357
hfenergy: -994.1282478 hartree
pointgroup: C01 [X(C16H16O5)]
dipole: -2.6777939 -1.2436178 0.5968942 debye
polarizability: 323.2704532|-9.0089723|208.4879393|-5.0605067|0.9197475|103.7114354 unknown
InChI: InChI=1S/C16H16O5/c1-8(2)12-14(18-3)10-7-9-5-6-11(17)20-13(9)16(19-4)15(10)21-12/h5-8H,1-4H3
charge 0 multiplicity 1
37 atoms
O  -1.680598 1.109477 -0.089304
O  -2.687558 -2.392419 -0.308462
O  3.224652 0.855825 -0.115212
O  1.113126 2.476401 -0.018706
O  5.527926 0.727256 -0.148137
C  -4.098225 0.476889 -0.149404
C  -2.657977 0.062987 -0.129342
C  -0.580423 -0.943366 -0.177658
C  -0.415435 0.475674 -0.105999
C  -2.024879 -1.164474 -0.183576
C  0.840498 1.119692 -0.082305
C  0.543751 -1.781771 -0.251356
C  1.829899 -1.180136 -0.234771
C  1.967621 0.243773 -0.142789
C  -4.437152 1.275466 -1.439422
C  -4.480551 1.284662 1.121133
C  3.052403 -1.955556 -0.309795
C  4.293029 -1.361814 -0.286828
C  4.460062 0.087421 -0.183547
C  -2.580653 -3.269295 0.879251
C  -0.000401 3.434307 0.126204
H  -4.677543 -0.466766 -0.161865
H  0.446831 -2.867632 -0.343836
H  -4.201197 0.689937 -2.345257
H  -5.512926 1.52731 -1.45858
H  -3.861516 2.217658 -1.476506
H  -3.906205 2.226978 1.170351
H  -5.555979 1.537639 1.101416
H  -4.276628 0.709544 2.04202
H  2.969935 -3.046193 -0.387204
H  5.217834 -1.941246 -0.343507
H  -3.101133 -4.199037 0.605048
H  -3.07246 -2.800954 1.753237
H  -1.524488 -3.486196 1.126332
H  -0.677817 3.390261 -0.7434
H  0.494103 4.41481 0.179773
H  -0.570827 3.24019 1.051204
