program: Gaussian 09
title: 000156708
version: EM64L-G09RevD.01
frameworkgroup: C1[X(C11H8Cl2N2O2)]
method: RPBEPBE
basis: SDD
operation: Freq
keyword: #p
keyword: freq=noraman
keyword: PBEPBE/SDD
title: #p freq=noraman PBEPBE/SDD
converged: YES YES NO NO
title: Mulliken charges:
elementType: Cl Cl O O N N C C C C C C C C C C C H H H H H H H H
charge: 0.000865 0.004078 -0.269793 -0.237225 -0.150035 -0.398270 -0.598592 0.568538 0.236710 -0.057510 -0.326437 -0.443256 -0.289540 -0.081919 -0.193205 0.151113 -0.112244 0.279395 0.241258 0.250984 0.300908 0.239665 0.363932 0.259160 0.261418
chargesum: 0.00000
title: Mulliken charges with hydrogens summed into heavy atoms:
elementType: Cl Cl O O N N C C C C C C C C C C C
charge: 0.000865 0.004078 -0.269793 -0.237225 -0.150035 -0.034338 -0.077938 0.568538 0.236710 0.193473 -0.025529 -0.203590 -0.030380 -0.081919 0.068214 0.151113 -0.112244
polarizability: 2.01963797e+02 2.12534546e+00 1.55432681e+02 -4.60936259e+00 1.88379666e+00 1.09397037e+02
1716.lowfreq: -7.4585 -3.5595 -0.0028 -0.0022 0.0013 3.4843 16.1346 29.2780 37.2572
frequency: 15.8860 29.2576 37.2284 85.3809 118.8513 168.6502 172.1489 182.0335 186.1601 264.1437 298.9240 332.7959 360.0230 383.9373 407.5364 433.7191 437.7934 442.7257 491.4518 514.5696 574.7421 590.8338 644.4556 671.8858 684.4556 699.9666 714.1793 738.4055 769.3953 783.8031 806.2398 828.4652 862.6933 915.1908 931.1351 942.3075 952.3394 958.3251 1005.9996 1064.5196 1120.5298 1142.4854 1158.3611 1203.4184 1212.7907 1219.3492 1260.6758 1302.3900 1344.5856 1360.8428 1369.5285 1377.2640 1392.5868 1421.5227 1456.4221 1466.3058 1571.2415 1594.9774 1604.0617 1641.4031 1667.5573 3027.5053 3089.9379 3133.0927 3154.5137 3165.0043 3172.2115 3216.9468 3521.5252
redmass: 8.4370 11.4428 8.1600 8.6035 6.8482 6.9486 8.3020 8.4084 24.4741 7.7861 7.4489 4.4237 5.8338 5.5144 3.3016 4.2940 5.2236 3.7642 5.6811 6.6077 5.8246 5.6487 6.0464 6.2247 2.9041 2.7973 3.5925 4.9650 1.9585 2.8584 1.9485 1.6967 3.9626 1.6123 2.3985 1.3158 1.5503 1.9174 5.6974 2.0432 2.0889 1.7163 3.8991 1.8633 2.1418 1.5471 1.4952 3.0836 1.7515 1.4761 2.8549 2.5765 2.1729 2.9733 2.1230 1.2692 7.4561 6.4900 5.4538 9.7132 6.0833 1.0602 1.1039 1.0902 1.0934 1.0915 1.0954 1.0972 1.0770
irintensity: 0.6798 0.3703 3.0847 0.3109 0.8859 1.6634 4.4657 1.0959 0.2185 1.3759 1.5917 4.1085 13.0953 6.7700 5.4329 31.5083 8.8172 8.1059 13.3376 7.8543 15.7145 2.3227 11.5860 16.3041 20.5310 5.3219 7.9656 0.2158 37.8101 47.4547 115.0966 17.0472 19.5106 12.6123 16.9653 1.0409 1.8122 1.7753 37.5801 11.8688 28.5656 14.7415 10.9670 17.8495 106.8044 19.9276 7.3135 111.1543 69.7343 14.7284 12.2493 22.4473 19.2166 77.7473 67.9522 50.6223 18.7777 7.8185 15.1134 241.4466 798.9137 24.9909 3.9998 9.1019 3.0830 3.9287 2.7295 0.8541 60.7482
temp: 298.150 k
press: 1.00000 atm
elementType: 17 17 8 8 7 7 6 6 6 6 6 6 6 6 6 6 6 1 1 1 1 1 1 1 1
symmnumber: 1
zpe: 453812.9 jmol-1
zpe.correction: 0.172848 hartree
zpe.thermalcorrener: 0.187623 hartree
zpe.thermalcorrenthalpy: 0.188567 hartree
zpe.thermalcorrgfe: 0.127898 hartree
zpe.sumelectzpe: -1602.866604 hartree
zpe.sumelectthermal: -1602.851830 hartree
zpe.sumelectthermalent: -1602.850886 hartree
zpe.sumelectthermalfe: -1602.911555 hartree
dipole: -1.0118 -5.1780 1.9487
dipole: 5.6243
quadrupole: -137.9016 -101.5928 -118.6630
quadrupole: -2.6416 8.3548 -2.5317
quadrupole: -18.5158 17.7930 0.7228 -2.6416 8.3548 -2.5317
hfenergy: -1603.0394523 hartree
pointgroup: C01 [X(C11H8Cl2N2O2)]
dipole: -0.4811648 -1.7108149 1.3182911 debye
dipolederiv: -0.1501132 0.1546447 -0.1034003 0.2319591 -0.4805445 0.2560445 -0.1547073 0.2553648 -0.1817893 -0.6274286 -0.0778314 -0.280749 -0.0918117 -0.0636476 -0.0330628 -0.3440695 -0.0346194 -0.1898939 -0.7112947 0.1720816 0.1644901 0.2338069 -1.019394 -0.3409295 0.208363 -0.242612 -0.5318052 -1.1103122 -0.0108095 0.422797 -0.1988372 -0.4699849 0.1007928 0.5355058 -0.0088574 -0.669221 -0.9017014 -0.1713413 0.1197878 0.5448668 -0.9722946 -0.4540337 0.4737084 0.0420546 -0.4201583 -0.9330965 0.2312225 0.350098 0.3014474 -0.4992121 -0.2487776 0.4797915 -0.2028039 -0.6213844 0.8801996 0.0340996 -0.0461382 -0.0312606 0.1001293 -0.0744999 -0.2606119 -0.0908616 0.3708169 0.0812557 0.0396184 0.0734898 -0.016454 0.0463585 -0.0025306 0.0966871 0.0109162 -0.1174818 1.0723743 -0.0078376 -0.395883 -0.0977616 1.5264402 0.4003628 -0.5403124 0.1491664 0.6169298 0.6258457 -0.1307284 -0.3664055 -0.6906007 0.3796896 0.3706067 -0.5996925 0.1564982 0.3162954 -0.1602431 0.1196615 -0.0532016 0.0428463 -0.1804738 0.0413386 -0.0757477 0.1054242 -0.128992 -0.1309921 -0.0073416 0.0725009 0.0645862 0.0065861 -0.0514889 0.0366087 -0.0644698 -0.0892811 -0.6914383 -0.0656217 0.2050505 -0.3605875 -0.2312664 0.2188085 0.2941011 0.0532133 -0.3584 -0.007989 -0.3434175 0.1171558 -0.3472661 0.7261958 -0.3999908 0.1373617 -0.4843403 0.1799086 -0.1997192 -0.0071324 -0.053242 0.0682052 0.0188455 0.0101778 -0.1035306 -0.0413458 -0.110006 1.3793386 -0.0436518 -0.6714453 0.213053 0.9014206 -0.0098345 -0.7906001 0.1157797 0.7715333 0.8478823 0.2217902 0.4318217 0.1375545 -0.1016675 0.0887394 0.5219905 0.1531157 0.1849545 0.0060613 -0.0096701 -0.0351048 0.0633285 0.058928 -0.1062785 -0.0010201 -0.0075937 0.0891291 -0.0208637 0.0033244 -0.0011884 0.0093898 -0.0353249 0.1680737 0.0144806 0.0535068 0.0324477 0.1095935 -0.0935278 0.0568521 -0.0692502 0.0038245 0.0063189 0.0452186 0.0364435 0.1128202 0.1682198 -0.0577016 -0.0319298 -0.0414323 0.062849 0.020329 -0.0031737 0.0045388 0.1242538 0.0732074 0.0637939 -0.0872689 0.0524879 -0.0017359 0.0796085 -0.0762211 0.0861066 0.0719478 0.2340334 0.0276841 0.0833917 0.0526519 0.197495 -0.0348653 0.0857115 -0.0234103 0.2690905 0.106311 0.0228846 0.0579145 -0.0027156 0.0191605 -0.0231167 0.0638105 -0.0375105 0.1419534 0.0608695 -0.0641927 -0.0293931 -0.0682059 0.0076237 0.0182079 -0.043652 0.0162957 0.1363323 unknown
polarizability: 202.0306931|2.8479946|152.2253872|3.4408265|-11.8634924|112.537434 unknown
InChI: InChI=1S/C11H8Cl2N2O2/c12-8-2-1-7(5-9(8)13)6-15-4-3-10(16)14-11(15)17/h1-5,14H,6H2
charge 0 multiplicity 1
25 atoms
Cl -3.318934 2.105696 -1.349179
Cl -5.001892 -0.718244 -1.393355
O  1.505451 2.165889 1.063719
O  4.781589 0.17357 -1.622643
N  1.48909 -0.179611 0.844682
N  3.135466 1.115813 -0.25409
C  0.293359 -0.271979 1.731321
C  -1.017936 -0.381624 0.963009
C  2.013282 1.115012 0.581394
C  2.037583 -1.318401 0.25972
C  -1.515137 0.741988 0.256514
C  -1.753841 -1.590736 0.945559
C  3.13032 -1.279777 -0.570383
C  -2.72136 0.646993 -0.462938
C  -2.965289 -1.684322 0.227053
C  3.773581 -0.003975 -0.884441
C  -3.448499 -0.565299 -0.480754
H  0.303674 0.642179 2.348538
H  0.431231 -1.145625 2.392056
H  1.53621 -2.258474 0.507459
H  -0.964673 1.68869 0.273543
H  -1.392111 -2.465063 1.499102
H  3.538192 2.038099 -0.451383
H  3.544767 -2.186987 -1.010195
H  -3.538823 -2.615512 0.21209
