program: Gaussian 09
title: 000014113
version: EM64L-G09RevD.01
frameworkgroup: C1[X(C10H13NO2)]
method: RPBEPBE
basis: SDD
operation: Freq
keyword: #p
keyword: freq=noraman
keyword: PBEPBE/SDD
title: #p freq=noraman PBEPBE/SDD
converged: YES YES NO NO
title: Mulliken charges:
elementType: O O N C C C C C C C C C C H H H H H H H H H H H H H
charge: -0.415202 -0.239981 -0.565923 -0.229188 0.519238 -0.504041 -0.441120 -0.444826 -0.391676 0.194781 -0.218380 -0.243654 -0.244719 0.237490 0.248312 0.225509 0.235870 0.210924 0.239100 0.222558 0.276692 0.275892 0.225419 0.223102 0.227820 0.376005
chargesum: 0.00000
title: Mulliken charges with hydrogens summed into heavy atoms:
elementType: O O N C C C C C C C C C C
charge: -0.039198 -0.239981 -0.013340 0.008302 0.519238 -0.030220 0.005674 -0.205726 -0.169118 0.194781 0.007039 -0.020552 -0.016900
polarizability: 1.38419064e+02 1.48382886e+01 9.94984289e+01 4.51660428e-01 -3.86703213e+00 1.14501548e+02
1716.lowfreq: -8.6242 -4.2598 -0.0007 0.0006 0.0007 10.4268 23.4973 31.1361 46.6070
frequency: 21.5847 31.1221 46.5792 87.8263 104.7886 153.3258 185.5259 232.7424 281.8372 311.4773 325.7260 383.6476 403.2194 423.7673 477.4046 526.1448 536.1653 595.1310 607.6348 617.6736 666.7998 703.9682 764.0497 776.0459 820.5469 849.7878 881.6966 912.6894 948.7508 965.2477 973.1940 990.5690 993.9607 1027.7056 1048.8656 1063.3584 1077.6202 1106.3654 1140.4860 1171.8098 1181.3087 1189.3944 1211.9892 1252.0442 1289.1255 1298.4442 1331.6367 1335.9174 1347.5537 1367.5469 1387.1762 1442.0502 1443.3118 1456.0372 1483.1811 1591.9813 1612.8149 1635.9097 1661.0366 2963.3582 2988.6494 2999.3672 3051.0212 3073.0007 3112.0139 3120.2936 3132.2151 3143.6384 3161.8979 3503.5196 3507.2534 3637.0056
redmass: 3.9335 7.5536 7.1451 2.6224 3.6562 3.1741 3.2665 3.3435 1.3103 3.0805 2.7524 1.4465 2.7875 3.2499 3.0568 2.3849 2.7551 3.7171 3.1196 6.0067 1.6951 1.6583 2.2504 2.8711 1.5572 1.2511 3.8018 1.4744 1.9725 2.5553 1.4008 5.0792 1.3750 2.2001 2.8064 2.0196 1.6177 3.9603 1.6999 1.0562 1.3111 1.1183 2.0334 1.4879 1.5139 1.4954 1.2301 1.2103 1.4543 1.6982 4.0370 1.3794 1.5147 1.0958 2.3101 5.9347 6.0906 1.0986 8.3494 1.0656 1.0620 1.0828 1.1041 1.0929 1.0868 1.0865 1.0912 1.0959 1.1015 1.0443 1.0637 1.1003
irintensity: 0.3710 1.7199 0.8895 4.6734 1.6881 1.8132 5.5839 2.7832 43.5585 4.9697 39.8380 253.2625 0.1735 97.2092 100.6517 27.6608 53.3246 23.6855 6.5150 2.1311 110.7230 58.5272 24.2071 10.2791 4.8664 0.3515 14.1996 0.2699 18.2047 2.6966 0.3923 0.7267 0.1003 9.1828 202.8583 75.8841 10.0518 39.2767 37.3522 0.1429 2.8187 0.5908 3.3315 0.8244 1.5340 28.1777 1.0516 10.0671 27.4420 22.7956 1.3241 24.3059 6.5525 3.8404 18.8368 2.0237 10.0317 35.5977 185.3311 33.9442 25.7638 14.9018 25.0166 13.5711 11.6108 2.5269 12.9410 41.8449 23.1207 7.3144 20.4033 3.7412
temp: 298.150 k
press: 1.00000 atm
elementType: 8 8 7 6 6 6 6 6 6 6 6 6 6 1 1 1 1 1 1 1 1 1 1 1 1 1
symmnumber: 1
zpe: 557152.0 jmol-1
zpe.correction: 0.212208 hartree
zpe.thermalcorrener: 0.225358 hartree
zpe.thermalcorrenthalpy: 0.226302 hartree
zpe.thermalcorrgfe: 0.170489 hartree
zpe.sumelectzpe: -593.090141 hartree
zpe.sumelectthermal: -593.076992 hartree
zpe.sumelectthermalent: -593.076047 hartree
zpe.sumelectthermalfe: -593.131860 hartree
dipole: 0.5405 -0.1379 -1.0154
dipole: 1.1586
quadrupole: -68.7914 -81.1596 -75.7035
quadrupole: 2.0402 -1.6470 2.3452
quadrupole: 6.4268 -5.9414 -0.4853 2.0402 -1.6470 2.3452
hfenergy: -593.3023491 hartree
pointgroup: C01 [X(C10H13N1O2)]
dipole: 0.2418804 0.1595299 0.3518731 debye
dipolederiv: -0.4359759 -0.1071976 -0.0633119 -0.2492717 -1.0923257 -0.4172024 -0.0641913 -0.3808747 -0.422351 -0.3580464 -0.0575159 0.0052386 -0.1219096 -0.6337414 0.1231123 -0.0227204 -0.061456 -0.9283089 -0.6741804 0.2880293 0.0011327 0.4169524 -1.079952 0.2768556 -0.0204559 0.3073697 -0.2846117 -0.0006648 0.1429315 -0.0348107 0.2851765 -0.0701764 0.0348062 -0.1460572 0.2009871 0.046007 0.3870104 -0.127751 -0.0143652 -0.0630749 -0.1234225 0.0188584 -0.0446036 0.0128168 -0.0444693 0.000144 0.0865558 -0.0796346 -0.065439 -0.3576478 0.1526471 -0.0053571 0.1823457 -0.0537438 0.5169802 -0.2857255 0.0159027 -0.4224457 0.5770104 -0.071059 0.065855 -0.1775515 0.2277179 -0.178263 0.0105515 -0.0451752 -0.0108388 -0.1335096 0.0117126 -0.0758961 0.0456665 0.0593635 -0.1201922 0.0032621 0.0606047 0.003315 -0.1478618 0.0130901 0.142796 -0.022395 0.0107287 0.2326492 0.1209666 0.099843 0.3907329 1.5550399 0.0873519 0.0458132 0.1363557 1.1931595 0.0310049 -0.0345964 0.0822787 -0.0450451 -0.1208753 0.0014298 0.0846754 0.0074544 0.082454 -0.0080755 -0.0474029 -0.033619 -0.0521893 -0.1277025 0.0429969 -0.0677236 0.0477338 0.1094538 0.0407691 -0.0513803 -0.017937 -0.0492809 -0.1599111 0.0172309 -0.0022285 0.0118319 -0.0890128 0.0295946 -0.0086434 0.0049051 0.0208383 0.0454867 -0.027246 0.0454378 -0.0596331 -0.0985065 0.1127443 -0.0129133 0.0690364 -0.0026901 0.0438919 -0.0254906 0.0307138 -0.0413553 -0.0632586 -0.1378782 -0.0322375 0.0160652 0.0469304 0.1937376 0.0002422 0.0167801 0.0187348 0.0724697 -0.0501299 -0.0908349 -0.039399 -0.0942377 -0.0682343 -0.0132425 -0.0694417 -0.029941 0.0519656 0.0476597 0.0305962 0.0357837 0.048106 0.041052 -0.0602933 0.0556789 0.0024478 -0.1321257 0.0573619 0.0336797 0.0901834 0.0330178 0.1274489 -0.0347508 0.0656691 -0.0337741 -0.0514921 0.0006269 0.0194174 -0.1199252 0.0235803 0.1268526 0.002673 -0.1200613 0.0009912 -0.023476 0.0789177 -0.0522791 -0.0173813 -0.1503932 0.2938706 -0.1674759 0.0369207 -0.1708041 0.21088 0.1228856 0.0289949 0.0101014 -0.0782684 0.4253128 0.0076586 0.0502412 -0.0747362 0.0417028 -0.0061009 0.0228906 -0.099994 0.0273171 0.1482453 -0.0002812 -0.1185815 0.0018139 -0.0519878 0.0442247 0.0323377 0.0642289 0.0358453 0.1391099 -0.0484267 0.086028 -0.0502057 -0.0938077 -0.1242241 0.068328 0.0218203 0.0737828 0.1419911 -0.0148417 0.022229 -0.0141958 0.087068 0.3911583 0.0199368 -0.0115717 -0.0005104 0.2563105 0.0896446 0.0084798 0.1403731 0.1441815 unknown
polarizability: 138.9610839|-14.1600111|98.4554961|1.5615664|1.7207917|115.0024608 unknown
InChI: InChI=1S/C10H13NO2/c11-7-9(6-10(12)13)8-4-2-1-3-5-8/h1-5,9,12H,6-7,11H2
charge 0 multiplicity 1
26 atoms
O  2.044476 2.684226 0.090834
O  1.771373 1.475028 -1.870502
N  2.483709 -2.737075 0.369783
C  0.861794 -0.80696 -0.183594
C  -0.599376 -0.395014 -0.014966
C  1.849029 0.286625 0.29869
C  1.145787 -2.17071 0.549731
C  -1.46429 -0.330175 -1.136893
C  -1.136393 -0.104418 1.268072
C  1.869959 1.488394 -0.62293
C  -2.826923 0.01433 -0.985848
C  -2.496876 0.239969 1.423804
C  -3.349182 0.299541 0.2963
H  1.057217 -0.96451 -1.26279
H  1.632617 0.621218 1.327111
H  2.874056 -0.142552 0.295491
H  0.396192 -2.902424 0.19314
H  0.965724 -2.047603 1.634933
H  -1.06102 -0.538584 -2.135203
H  -0.490165 -0.14297 2.154207
H  3.24271 -2.339048 0.92307
H  2.74876 -2.993019 -0.582601
H  -3.477485 0.063995 -1.86648
H  -2.892867 0.461814 2.421485
H  -4.404911 0.567682 0.415999
H  2.067585 3.444941 -0.552244
