program: Gaussian 09
title: 000156672
version: EM64L-G09RevD.01
frameworkgroup: C1[X(C16H22FN3O)]
method: RPBEPBE
basis: SDD
operation: Freq
keyword: #p
keyword: freq=noraman
keyword: PBEPBE/SDD
title: #p freq=noraman PBEPBE/SDD
converged: YES YES NO NO
title: Mulliken charges:
elementType: F O N N N C C C C C C C C C C C C C C C C H H H H H H H H H H H H H H H H H H H H H H
charge: -0.217400 -0.273415 -0.427481 -0.056646 -0.545643 -0.007954 -0.438152 -0.355954 0.455807 -0.714769 -0.259763 -0.410601 0.270659 -0.569572 0.350896 -0.028292 0.192595 -0.342887 -0.777690 -0.387107 -0.507767 0.200875 0.200992 0.193888 0.186387 0.209283 0.326903 0.210625 0.239877 0.213782 0.206154 0.204021 0.269614 0.227025 0.263030 0.261078 0.246961 0.243119 0.213665 0.238898 0.240351 0.224036 0.230574
chargesum: 0.00000
title: Mulliken charges with hydrogens summed into heavy atoms:
elementType: F O N N N C C C C C C C C C C C C C C C C
charge: -0.217400 -0.273415 -0.100578 -0.056646 -0.021535 0.192921 -0.043272 0.039716 0.455807 -0.050486 -0.259763 -0.000426 0.270659 -0.299958 0.350896 -0.028292 0.192595 -0.115862 -0.073946 -0.148209 0.187193
polarizability: 2.59600106e+02 -5.81117063e+00 2.51345588e+02 2.32433543e+01 1.07335935e+01 1.34483672e+02
1716.lowfreq: -8.9620 -5.6654 -2.5608 0.0003 0.0004 0.0007 18.9448 22.9465 46.3237
frequency: 18.7520 22.8291 46.2588 48.1483 64.3218 79.1278 89.2505 92.0678 125.0759 142.4235 167.7326 185.6705 196.7059 210.0344 215.8725 225.3026 227.0930 248.4626 265.4010 279.4843 299.8426 311.1399 331.7699 359.6310 364.8953 383.1268 428.1550 449.7901 480.7843 490.6091 499.4740 534.2297 564.0919 586.2198 613.8923 632.8090 650.3542 656.7905 662.2187 701.4636 732.3323 791.8270 795.2888 809.4284 831.5908 841.4354 858.7610 887.2735 902.4957 945.5763 946.1645 960.1566 976.6296 1004.7562 1012.7153 1039.5158 1045.5982 1046.0355 1088.0443 1098.8786 1102.5241 1107.6160 1113.0506 1148.3801 1156.1831 1162.4640 1202.5619 1214.5711 1244.5019 1247.0017 1259.0663 1282.1809 1293.4480 1307.1359 1319.4518 1333.1670 1342.1468 1346.0042 1354.0456 1364.5882 1382.6624 1385.4633 1405.3497 1412.1425 1434.8206 1455.4060 1456.7731 1458.7736 1461.7349 1463.1334 1465.5944 1468.7613 1472.8947 1473.4316 1476.2236 1479.8573 1523.9230 1558.1499 1586.1976 1624.3573 1644.0543 2948.2399 2958.9620 2965.3895 2978.0142 2979.1167 2991.2908 2992.4308 3006.3434 3025.1207 3048.1326 3076.9836 3078.7029 3083.7211 3093.3476 3097.7238 3124.8864 3126.5727 3152.7278 3179.4765 3448.7192 3455.8809 3573.9370
redmass: 4.3616 4.9697 3.0831 1.7920 3.1705 3.9924 4.1248 3.9265 3.6623 2.3220 3.8846 3.0845 1.6255 1.3167 1.0585 2.5615 1.9719 1.1157 4.1951 3.4833 6.1106 3.9104 3.3863 5.0524 5.6638 3.7333 5.3889 3.3442 3.3156 3.9265 2.7665 5.9045 5.2286 4.2146 1.5250 1.4277 6.6685 5.0577 2.3399 6.0036 1.1103 3.1811 3.9170 1.6672 1.9775 1.2233 1.9635 6.8583 2.9386 1.4008 1.9566 1.4238 6.6423 2.7847 1.7150 1.4385 1.6041 2.8921 3.3566 2.1006 2.7867 1.5156 2.0952 2.0730 1.8790 1.7019 2.3626 1.8999 1.7669 1.7631 1.4427 1.3429 1.7651 1.3506 2.4388 1.2149 1.4627 1.4328 1.3934 3.3419 1.2646 2.5753 1.2512 2.0031 2.2635 1.1275 1.9320 1.1169 1.0673 1.0476 1.4127 1.0665 1.2314 1.3725 1.0770 1.1876 4.0397 5.0859 6.6732 7.6399 1.0882 1.0762 1.0671 1.0630 1.0509 1.0447 1.0305 1.0361 1.0966 1.1012 1.1049 1.0998 1.0968 1.0998 1.1009 1.1032 1.1047 1.0880 1.0966 1.0912 1.0446 1.0758 1.0972
irintensity: 0.1941 0.0424 6.3323 3.4603 5.2482 0.0782 0.7271 3.0329 1.5814 0.2003 0.0728 0.1199 0.1067 1.7457 1.1677 6.7056 1.4850 46.7437 3.8676 6.7489 4.3585 2.1121 5.9082 3.8277 1.7364 1.5097 6.8512 2.9488 11.7629 1.2041 15.7857 7.2196 2.5136 6.3628 417.4694 24.7520 5.1059 7.9239 15.3644 23.6248 6.5997 3.0793 3.8116 2.5369 35.7712 26.0286 4.3853 5.0080 7.5230 0.1055 3.4211 3.0195 125.0382 19.4776 3.5350 8.8211 9.4483 5.8066 30.6368 14.9381 2.6308 3.8750 18.3337 9.9868 14.9033 12.6220 7.2695 206.7745 1.2556 2.1589 4.6422 2.5118 8.2707 4.6670 28.8924 1.1462 9.2234 18.2792 12.2824 50.0314 22.9893 29.4925 31.0336 139.8871 1.3781 10.5409 52.3895 8.0714 5.8660 17.5195 64.4640 52.2842 10.0884 18.7691 14.8540 2.5966 195.9080 217.9590 55.7413 307.5173 32.0142 12.2560 5.8276 26.2174 26.4172 104.3954 66.5990 31.4764 1.6958 4.7053 100.0619 52.9625 12.4263 35.3651 23.7631 38.0400 23.4841 11.4665 36.5211 7.1991 1.4636 44.6741 0.1264
temp: 298.150 k
press: 1.00000 atm
elementType: 9 8 7 7 7 6 6 6 6 6 6 6 6 6 6 6 6 6 6 6 6 1 1 1 1 1 1 1 1 1 1 1 1 1 1 1 1 1 1 1 1 1 1
symmnumber: 1
zpe: 932736.2 jmol-1
zpe.correction: 0.355260 hartree
zpe.thermalcorrener: 0.377558 hartree
zpe.thermalcorrenthalpy: 0.378502 hartree
zpe.thermalcorrgfe: 0.302379 hartree
zpe.sumelectzpe: -960.628450 hartree
zpe.sumelectthermal: -960.606153 hartree
zpe.sumelectthermalent: -960.605209 hartree
zpe.sumelectthermalfe: -960.681332 hartree
dipole: -1.3143 -0.5349 0.4016
dipole: 1.4747
quadrupole: -128.1194 -114.6845 -125.7606
quadrupole: -7.5241 2.5990 0.4360
quadrupole: -5.2645 8.1703 -2.9058 -7.5241 2.5990 0.4360
hfenergy: -960.9837108 hartree
pointgroup: C01 [X(C16H22F1N3O1)]
dipole: -0.4979925 -0.2488191 0.1634191 debye
polarizability: 260.9518297|-5.0445823|250.4513073|20.7971647|12.8541743|134.026229 unknown
InChI: InChI=1S/C16H22FN3O/c1-10-6-8-19-16-12(20-11(2)5-4-7-18)9-13(21-3)15(17)14(10)16/h6,8-9,11,20H,4-5,7,18H2,1-3H3
charge 0 multiplicity 1
43 atoms
F  -3.812021 -0.918683 -0.723391
O  -1.940815 -3.179178 -0.619056
N  1.588757 -0.201024 0.782539
N  -0.057261 1.905485 0.828858
N  5.908882 1.460439 -2.111568
C  2.654579 -1.209001 0.875889
C  4.029261 -0.515209 0.709999
C  4.25753 0.110344 -0.684402
C  0.275347 -0.445817 0.446206
C  2.577723 -2.0065 2.204526
C  -0.623064 0.704749 0.45673
C  5.625384 0.836846 -0.803053
C  -2.018377 0.554952 0.091387
C  -0.242245 -1.705891 0.100938
C  -2.84193 1.748348 0.124631
C  -2.462627 -0.74956 -0.282228
C  -1.610094 -1.866494 -0.268202
C  -2.226276 2.950781 0.508912
C  -4.318034 1.750208 -0.223642
C  -0.845194 2.997427 0.851488
C  -3.344357 -3.633831 -0.604511
H  2.526667 -1.919117 0.030914
H  4.820769 -1.262908 0.915984
H  4.130703 0.266079 1.494362
H  4.20131 -0.683028 -1.459025
H  3.443797 0.827639 -0.912605
H  1.773143 0.77452 1.046633
H  3.319178 -2.826946 2.212964
H  1.574325 -2.445306 2.346756
H  2.783937 -1.342515 3.064048
H  5.687245 1.626563 -0.028227
H  6.442355 0.122029 -0.581103
H  0.372265 -2.608565 0.104024
H  -2.81729 3.871799 0.549044
H  5.26733 2.222744 -2.353979
H  5.997312 0.788539 -2.881008
H  -4.48942 1.424278 -1.264542
H  -4.886983 1.053389 0.416496
H  -4.737465 2.763128 -0.09922
H  -0.374277 3.940507 1.150436
H  -3.912484 -3.210446 -1.448495
H  -3.838734 -3.365057 0.346165
H  -3.274648 -4.728316 -0.699976
