program: Gaussian 09
title: 000156669
version: EM64L-G09RevD.01
frameworkgroup: C1[X(C12H8Cl2N2O)]
method: RPBEPBE
basis: SDD
operation: Freq
keyword: #p
keyword: freq=noraman
keyword: PBEPBE/SDD
title: #p freq=noraman PBEPBE/SDD
converged: YES YES NO NO
title: Mulliken charges:
elementType: Cl Cl O N N C C C C C C C C C C C C H H H H H H H H
charge: -0.050471 -0.035889 -0.194095 -0.453128 0.023400 0.246168 0.314295 0.155233 -0.339236 -0.363333 -0.271432 -0.222305 -0.232274 -0.052771 -0.224014 -0.058244 -0.340692 0.325073 0.274372 0.232319 0.235691 0.232995 0.288180 0.235486 0.274672
chargesum: 0.00000
title: Mulliken charges with hydrogens summed into heavy atoms:
elementType: Cl Cl O N N C C C C C C C C C C C C
charge: -0.050471 -0.035889 -0.194095 -0.128054 0.023400 0.246168 0.314295 0.155233 -0.064864 -0.131014 -0.271432 0.013386 0.000722 0.235408 0.011472 -0.058244 -0.066020
polarizability: 2.93478663e+02 1.29249579e+01 1.60261282e+02 -5.92796107e+00 1.07276197e+01 7.87804879e+01
1716.lowfreq: -4.2973 -2.9935 0.0022 0.0024 0.0030 5.1569 19.3893 32.0566 42.1213
frequency: 19.3182 32.0213 42.1208 84.8378 109.6181 139.5477 160.9641 164.9930 212.7646 232.4148 288.7705 349.1796 359.2139 396.2849 404.6251 420.1567 442.6396 451.4382 492.4409 550.0347 611.4182 613.7899 646.1738 662.6443 687.7307 704.8704 725.9170 744.4740 792.6643 846.9085 857.4014 871.9107 875.8840 898.3025 941.3290 984.6137 986.5425 990.3419 1007.8274 1023.7340 1068.5337 1090.3110 1096.2525 1174.9872 1190.3988 1202.9562 1232.6411 1303.8397 1309.6355 1321.3950 1361.1157 1385.8949 1429.3440 1437.2065 1463.1685 1480.2901 1539.9221 1562.8620 1584.1014 1609.5217 1630.8035 3123.0933 3134.7046 3147.5439 3158.1313 3159.4953 3171.1168 3184.4030 3506.8014
redmass: 7.2329 6.4734 6.5388 9.2086 6.0478 6.7753 6.7907 11.8311 7.9326 7.6316 8.2276 9.4427 9.6450 6.3375 3.2925 4.9415 4.7130 7.3798 4.8735 3.5686 8.9729 6.6760 1.5142 3.7884 4.3306 1.5973 6.3091 7.3685 2.4661 6.4079 1.3449 3.6615 1.5317 1.3949 1.4650 6.1664 1.7322 3.3671 1.3478 2.5252 2.6969 1.8110 1.9989 1.0607 1.1236 2.1468 3.2704 2.8900 2.3367 1.6071 3.0043 9.0012 2.3045 2.4684 2.9380 2.2853 4.0346 8.5503 5.9115 5.9546 6.5455 1.0870 1.0874 1.0918 1.0933 1.0959 1.1011 1.0945 1.0760
irintensity: 1.0036 0.3306 0.6935 1.9792 1.1963 1.1510 0.3180 1.8371 1.2755 0.8493 8.2392 5.9333 7.8556 2.0441 0.6639 14.4591 2.4389 13.9938 3.1489 13.7719 4.8757 2.0960 44.5792 18.6762 18.5267 82.6232 76.0180 32.7053 9.3015 62.0790 1.1190 4.5957 24.1363 6.3584 1.9180 40.3787 3.7021 1.1761 2.2272 25.7937 98.9547 8.7155 14.4871 2.9484 32.6521 8.7955 275.0967 32.8117 88.9147 23.8574 20.8195 1.0886 86.6134 103.3241 640.7507 27.3521 275.8811 61.0768 20.8187 15.6474 108.6643 9.3516 2.3305 18.6145 7.2686 14.9385 23.4505 1.2001 27.5243
temp: 298.150 k
press: 1.00000 atm
elementType: 17 17 8 7 7 6 6 6 6 6 6 6 6 6 6 6 6 1 1 1 1 1 1 1 1
symmnumber: 1
zpe: 453913.0 jmol-1
zpe.correction: 0.172886 hartree
zpe.thermalcorrener: 0.187639 hartree
zpe.thermalcorrenthalpy: 0.188583 hartree
zpe.thermalcorrgfe: 0.128096 hartree
zpe.sumelectzpe: -1565.745408 hartree
zpe.sumelectthermal: -1565.730655 hartree
zpe.sumelectthermalent: -1565.729711 hartree
zpe.sumelectthermalfe: -1565.790198 hartree
dipole: 1.8859 3.6439 0.6191
dipole: 4.1495
quadrupole: -93.6533 -115.3252 -112.7196
quadrupole: 2.4844 0.5028 2.4912
quadrupole: 13.5794 -8.0925 -5.4869 2.4844 0.5028 2.4912
hfenergy: -1565.9182944 hartree
pointgroup: C01 [X(C12H8Cl2N2O1)]
dipole: -0.7411599 -1.4528504 0.0710406 debye
dipolederiv: -0.2328571 -0.2348492 -0.0851377 -0.1819274 -0.7277935 -0.2394827 -0.0551875 -0.2163077 -0.1217355 -1.0653854 -0.1008468 -0.0662799 -0.0910313 -0.1101602 -0.0255089 -0.0646534 -0.0226898 -0.0527289 -0.7690772 -0.0941819 0.0614538 0.3684343 -0.8507454 0.0808418 0.0754118 0.1081552 -0.3213205 -2.524107 0.3565921 -0.0285519 0.6865624 -0.4899427 0.0527973 0.0096321 0.0633093 -0.3478146 -0.5822158 0.1459091 0.0543849 -0.3315652 -0.2590421 -0.0551714 -0.0945731 -0.0545367 -0.2013487 -0.5383215 -0.0895194 0.0231577 -0.1772347 -0.0897923 0.0055213 0.0373872 0.0182724 -0.0163866 2.0739431 -0.2393097 0.0229318 0.1760237 -0.1267528 -0.042801 -0.0020527 -0.051317 0.1761331 2.4374424 -0.1065388 -0.0900206 -1.0140925 1.1762748 -0.1256995 -0.1806338 -0.1346788 0.250729 -0.0128418 0.0989536 -0.0387505 -0.1183377 0.0213412 -0.0757768 0.017667 -0.0458152 -0.0801069 0.0047446 -0.0339806 0.0652221 0.1531536 -0.044903 -0.0585815 0.0695243 -0.0582043 -0.0929416 -0.2955161 0.2998266 0.0823247 0.557328 0.9219895 0.3560759 0.1366191 0.3116733 0.0326866 0.0242903 -0.1395851 0.0943793 -0.1507177 -0.0515329 -0.0641932 0.0972667 -0.0662966 -0.1039347 -0.2160163 0.0426537 -0.024639 0.0978834 0.0678049 -0.1149632 -0.0740371 -0.1143149 -0.083415 -0.0822071 -0.0833564 -0.019645 -0.0356478 -0.09279 -0.024685 -0.018582 -0.0174841 -0.0303962 0.1026138 0.0590441 -0.0011186 0.0072991 -0.0305532 -0.0546308 0.0198634 -0.0549368 -0.1100915 1.3403162 0.2315144 0.1222021 -0.0482824 -0.0237865 -0.0000792 0.0310157 0.013379 -0.0620446 -0.1038399 -0.0887934 -0.0478673 0.1595062 0.2888432 0.1111139 0.0882188 0.0901968 0.0119887 0.2748182 -0.0163575 -0.0240059 -0.0716594 0.1615748 0.003172 0.0267927 -0.0180186 0.2926668 0.1476975 -0.048417 0.0202912 -0.0037749 0.0306201 0.0732257 0.0301479 0.0570238 0.1200749 -0.0116683 0.0808958 -0.0694546 0.1037831 0.0491984 0.0576532 -0.0946405 0.0478297 0.1035508 -0.0486666 0.073827 -0.0572428 0.0887063 0.042489 0.0714675 -0.0680978 0.0711752 0.1124369 0.0574869 -0.0347927 0.0125057 -0.0718698 -0.0403913 0.1098152 0.0232091 0.1095961 0.0960296 0.0892225 0.0342943 0.0083617 0.0364563 0.0711608 -0.0286346 0.0125857 -0.0252488 0.1593519 -0.1129231 -0.0604111 0.008623 -0.0637015 0.0905746 0.0326154 0.014484 0.0296297 0.1424697 0.0430677 -0.0525714 -0.0231243 -0.0752941 0.0163145 -0.0440914 -0.0373676 -0.0403911 0.1261471 unknown
polarizability: 293.2561798|12.3353272|161.6591517|9.7995109|-1.1229918|77.6051019 unknown
InChI: InChI=1S/C12H8Cl2N2O/c13-9-6-10(14)11(15-7-9)16-12(17)8-4-2-1-3-5-8/h1-7,16H
charge 0 multiplicity 1
25 atoms
Cl 1.55423 -2.753647 -0.877569
Cl 5.969057 0.467249 0.281458
O  -0.719236 2.025347 -0.376884
N  0.016855 -0.205415 -0.119406
N  1.941372 1.131589 0.375262
C  -2.384735 0.288394 -0.057351
C  1.408744 -0.049788 -0.04077
C  -0.974804 0.80825 -0.187852
C  -3.425768 1.095468 -0.585215
C  -2.711829 -0.932644 0.590944
C  2.267619 -1.14694 -0.354544
C  -4.768681 0.678997 -0.489752
C  -4.058462 -1.346331 0.689371
C  3.660033 -1.020725 -0.260762
C  -5.088624 -0.54602 0.143678
C  4.174688 0.228248 0.149602
C  3.288565 1.278983 0.462613
H  -0.303905 -1.16857 -0.254986
H  -3.155209 2.045585 -1.05746
H  -1.933023 -1.544027 1.062745
H  -5.565084 1.305745 -0.90512
H  -4.304321 -2.283468 1.200389
H  4.318893 -1.85788 -0.503116
H  -6.132636 -0.869162 0.220454
H  3.65446 2.254162 0.798372
