program: Gaussian 09
title: 000156654
version: EM64L-G09RevD.01
frameworkgroup: C1[X(CH3BrClN)]
method: RPBEPBE
basis: SDD
operation: Freq
keyword: #p
keyword: freq=noraman
keyword: PBEPBE/SDD
title: #p freq=noraman PBEPBE/SDD
converged: NO NO NO NO
title: Mulliken charges:
elementType: Br Cl N C H H H
charge: 0.069552 0.028484 -0.319853 -0.581445 0.265734 0.267053 0.270476
chargesum: 0.00000
title: Mulliken charges with hydrogens summed into heavy atoms:
elementType: Br Cl N C
charge: 0.069552 0.028484 -0.319853 0.221818
polarizability: 7.19127249e+01 -8.29362935e-01 4.45578348e+01 1.33932924e+00 -2.45777093e+00 2.21253383e+01
1716.lowfreq: -16.0768 -0.0026 -0.0025 -0.0021 12.0755 15.3945 183.9504 262.0425 293.1414
frequency: 183.9472 262.0350 293.1296 352.4268 462.9614 524.4057 908.4682 1083.7638 1100.6861 1394.1497 1419.0534 1451.6874 2979.6942 3089.7830 3098.4199
redmass: 25.0745 1.9607 1.3597 4.0202 5.8591 6.3983 7.0054 1.4046 1.4226 1.1348 1.0511 1.0443 1.0294 1.1032 1.1023
irintensity: 0.1984 8.9356 4.4586 8.1529 17.7614 75.2980 10.0901 43.0309 7.4443 3.5862 15.4253 10.8642 5.8647 10.1119 2.2368
temp: 298.150 k
press: 1.00000 atm
elementType: 35 17 7 6 1 1 1
symmnumber: 1
zpe: 111280.3 jmol-1
zpe.correction: 0.042384 hartree
zpe.thermalcorrener: 0.047644 hartree
zpe.thermalcorrenthalpy: 0.048589 hartree
zpe.thermalcorrgfe: 0.012286 hartree
zpe.sumelectzpe: -567.769066 hartree
zpe.sumelectthermal: -567.763806 hartree
zpe.sumelectthermalent: -567.762862 hartree
zpe.sumelectthermalfe: -567.799165 hartree
dipole: -0.3613 2.4820 1.2190
dipole: 2.7887
quadrupole: -39.3506 -36.0797 -42.0831
quadrupole: -2.5054 -0.3088 0.1203
quadrupole: -0.1795 3.0914 -2.9120 -2.5054 -0.3088 0.1203
hfenergy: -567.8114503 hartree
pointgroup: C01 [X(C1H3Br1Cl1N1)]
dipole: 0.0988233 -1.0037677 0.4317838 debye
dipolederiv: -0.6879976 0.2224845 0.0986775 0.2304697 -0.1609153 -0.020076 0.2974278 -0.0970601 -0.0892689 -0.5854108 -0.2977305 -0.0882935 -0.3576932 -0.34865 -0.0468603 -0.294433 -0.1796943 -0.1221924 1.176118 0.0412151 -0.0012293 0.1102048 0.4646619 0.0428087 0.0236089 0.129467 0.0227507 -0.0828109 0.0277077 -0.0154137 -0.0097665 -0.0507393 0.0515063 0.0015915 0.0473318 0.0801433 0.0314386 -0.0408208 -0.0548151 -0.0556906 0.0030661 -0.0221197 -0.0483333 0.0019004 0.0986479 0.1429129 0.0063997 0.0007372 0.0130545 0.0641543 -0.0080062 -0.0167097 0.0739713 -0.0922671 0.0057497 0.0407443 0.060337 0.0694212 0.0284222 0.0027474 0.0368479 0.024084 0.1021865 unknown
polarizability: 71.7081084|-2.099445|44.4278932|-2.0485062|3.5965448|22.4598965 unknown
InChI: InChI=1S/CH3BrClN/c1-4(2)3/h1H3
charge 0 multiplicity 1
7 atoms
Br -1.756353 0.586067 0.157787
Cl 1.442246 1.001392 0.166788
N  0.051621 -0.148705 -0.512352
C  0.259584 -1.481406 0.161482
H  -0.548286 -2.136822 -0.209032
H  0.248209 -1.461482 1.265583
H  1.238379 -1.849344 -0.195155
