program: Gaussian 09
title: 000156638
version: EM64L-G09RevD.01
frameworkgroup: C1[X(C16H25NO)]
method: RPBEPBE
basis: SDD
operation: Freq
keyword: #p
keyword: freq=noraman
keyword: PBEPBE/SDD
title: #p freq=noraman PBEPBE/SDD
converged: YES YES NO NO
title: Mulliken charges:
elementType: O N C C C C C C C C C C C C C C C C H H H H H H H H H H H H H H H H H H H H H H H H H
charge: -0.293774 -0.394708 -0.020069 -0.400998 -0.711070 -0.683971 0.251959 -0.475850 -0.474475 -0.396033 -0.122011 -0.117033 -0.156214 -0.228232 -0.213333 -0.197835 -0.167184 -0.740334 0.197436 0.254965 0.212843 0.222727 0.209883 0.202779 0.216167 0.228759 0.204393 0.289942 0.213315 0.209350 0.208851 0.210563 0.207505 0.221460 0.213985 0.263649 0.224405 0.220705 0.221700 0.213473 0.222358 0.226257 0.223694
chargesum: 0.00000
title: Mulliken charges with hydrogens summed into heavy atoms:
elementType: O N C C C C C C C C C C C C C C C C
charge: -0.293774 -0.104766 0.177367 0.066810 -0.075681 -0.034652 0.251959 -0.053186 -0.055060 -0.188528 0.099449 0.146616 0.057771 -0.003827 0.007372 0.023865 0.046289 -0.068024
polarizability: 2.73345935e+02 2.74283641e+01 2.22817036e+02 1.84344238e+01 -7.25923458e+00 1.57561407e+02
1716.lowfreq: -5.5981 -3.1297 -0.0005 0.0005 0.0007 2.8377 11.4570 17.5157 30.0959
frequency: 10.6954 17.2947 30.0753 40.3081 48.9303 53.5051 75.2626 85.1480 103.9082 109.0218 127.0787 159.1881 182.2710 195.8209 212.0465 221.3782 229.5202 253.6765 267.1816 272.2142 278.3486 311.9168 332.9054 348.6630 366.5949 381.6916 407.8179 444.6304 495.3469 508.1621 532.3318 539.1582 610.5003 685.0474 695.6746 766.4451 781.2766 798.6547 834.3422 859.0121 878.4808 882.8491 915.0208 918.8294 933.8210 941.4301 951.4401 952.5558 953.2854 978.8519 989.1793 1001.3771 1012.0510 1018.3243 1030.0978 1040.6289 1092.9869 1111.0966 1124.1406 1141.4085 1144.3801 1165.3422 1188.3526 1191.3447 1194.1153 1209.7447 1235.6388 1248.2995 1256.3919 1279.2442 1287.3849 1298.7214 1300.2269 1300.6834 1307.8891 1315.5003 1329.8203 1342.6637 1346.9523 1361.3295 1376.4846 1393.8729 1395.3040 1451.0751 1453.4289 1456.5338 1459.7202 1462.2505 1469.8010 1473.5905 1479.8435 1482.3302 1491.5953 1583.6383 1627.5036 1640.6741 1662.3420 1677.8317 2950.3546 2960.5639 2963.7981 2963.9113 2964.1013 2979.2912 2983.3064 3016.1650 3031.6435 3031.7761 3055.4430 3066.2227 3068.5411 3068.6494 3069.6626 3074.2047 3074.9201 3076.0705 3084.3164 3085.3959 3085.9463 3090.8365 3094.2785 3105.9327 3552.7279
redmass: 4.4112 3.9272 3.7211 3.0224 3.2809 2.5414 3.9233 2.4386 3.6560 2.8128 2.5581 1.4234 2.0250 1.3430 2.9202 2.0756 1.0878 2.6438 3.3519 3.1375 2.5303 3.2318 2.4787 3.3864 2.1751 1.9599 3.0846 3.1875 2.6488 1.9009 2.1337 1.9244 2.4406 3.6036 4.2420 1.3836 3.1749 1.7752 1.7686 1.8357 1.9532 1.8085 1.3040 1.7538 1.6732 1.1759 1.4943 1.8976 1.3356 2.3444 2.8041 1.0992 1.7165 1.2408 2.2895 1.5309 2.1826 1.9566 2.4422 1.7991 1.8786 1.9382 1.9687 1.9218 1.1862 1.6181 1.4048 1.2777 1.1872 1.4384 1.4452 1.2884 1.4241 1.2658 1.4072 1.4388 1.5462 1.4155 1.4887 1.3449 1.2225 1.2372 1.2234 1.1192 1.0927 1.1056 1.0475 1.0644 1.0651 1.0544 1.2954 1.1666 1.1953 6.3573 5.9887 5.9423 5.8371 5.9007 1.0613 1.0369 1.0779 1.0618 1.0368 1.0419 1.0636 1.0984 1.0966 1.0970 1.0993 1.0977 1.0986 1.0937 1.0933 1.0992 1.0914 1.0920 1.0926 1.0993 1.0892 1.0929 1.0892 1.0874 1.0771
irintensity: 0.4905 0.9656 0.3173 1.2334 2.7498 2.1810 2.5769 0.7994 1.8780 1.4590 1.1693 0.0706 0.3026 0.4262 0.8227 1.4805 0.1250 4.6920 1.0985 10.3044 1.6000 2.3922 0.8177 0.4808 1.0563 3.9365 7.7016 1.0811 1.5640 43.2828 26.2004 40.5582 18.2030 0.1948 3.1865 8.9533 6.3686 15.2214 1.5033 7.8411 4.0526 11.8585 3.6489 8.8550 16.2239 0.2577 0.2474 9.4938 4.7135 1.1066 36.5204 109.6137 22.5967 95.3697 4.8044 1.5913 2.9606 44.9137 2.0376 2.1420 10.4639 66.0787 2.4243 7.3890 0.6945 17.6211 33.9008 17.7810 85.4737 14.2496 1.1471 4.4261 6.6993 3.3545 10.4072 45.4819 13.9586 11.7565 19.3785 7.3127 24.9769 8.5044 18.6564 34.8074 23.8951 5.3969 14.0066 13.2152 18.7723 3.9113 78.1880 147.9291 83.5017 146.5462 33.0455 3.6506 108.9926 2.3525 18.2500 55.0019 13.7696 89.5617 36.8278 62.9407 55.7538 6.3600 26.9462 31.2885 51.7601 3.6229 19.5939 1.3528 12.8526 98.4469 0.1669 12.6287 7.6091 29.2551 33.2673 14.3911 99.1691 17.2200 19.4135
temp: 298.150 k
press: 1.00000 atm
elementType: 8 7 6 6 6 6 6 6 6 6 6 6 6 6 6 6 6 6 1 1 1 1 1 1 1 1 1 1 1 1 1 1 1 1 1 1 1 1 1 1 1 1 1
symmnumber: 1
zpe: 971252.9 jmol-1
zpe.correction: 0.369931 hartree
zpe.thermalcorrener: 0.392030 hartree
zpe.thermalcorrenthalpy: 0.392974 hartree
zpe.thermalcorrgfe: 0.314596 hartree
zpe.sumelectzpe: -753.235097 hartree
zpe.sumelectthermal: -753.212999 hartree
zpe.sumelectthermalent: -753.212054 hartree
zpe.sumelectthermalfe: -753.290433 hartree
dipole: -0.5807 -0.4179 3.4380
dipole: 3.5116
quadrupole: -100.6668 -103.8286 -108.4396
quadrupole: 4.8742 10.4358 1.2183
quadrupole: 3.6449 0.4831 -4.1279 4.8742 10.4358 1.2183
hfenergy: -753.6050281 hartree
pointgroup: C01 [X(C16H25N1O1)]
dipole: 0.2426062 0.1628605 1.3503337 debye
polarizability: 274.8260818|25.7000105|221.1576398|-19.0769332|7.4052879|157.7406567 unknown
InChI: InChI=1S/C16H25NO/c1-4-5-6-7-8-9-10-11-12-13-16(18)17-14-15(2)3/h4-7,10-13,15,17H,8-9,14H2,1-3H3
charge 0 multiplicity 1
43 atoms
O  -2.681519 -0.352857 -1.54937
N  -3.685016 -0.711081 0.529506
C  -6.176408 -0.5827 0.053748
C  -4.859783 -1.409585 -0.011014
C  -6.584306 -0.263442 1.512183
C  -6.076587 0.702925 -0.797589
C  -2.660492 -0.222521 -0.281256
C  2.879241 2.894924 0.314447
C  4.253313 2.276758 -0.106466
C  -1.555638 0.450299 0.456943
C  1.695611 2.175682 -0.282635
C  -0.481135 0.976987 -0.209264
C  4.501607 0.90692 0.480937
C  0.644227 1.651811 0.41999
C  4.756838 -0.225473 -0.240228
C  5.004674 -1.543472 0.34444
C  5.259507 -2.672496 -0.383102
C  5.512968 -4.042328 0.197155
H  -6.960514 -1.235291 -0.386324
H  -4.618283 -1.645331 -1.062514
H  -4.997491 -2.363453 0.537222
H  -7.565659 0.244505 1.543564
H  -6.659783 -1.181677 2.126072
H  -5.850465 0.414801 1.989845
H  -5.288679 1.371074 -0.403482
H  -5.817079 0.468882 -1.845334
H  -7.032919 1.258117 -0.78797
H  -3.613869 -0.583131 1.539958
H  2.870875 3.953723 -0.022153
H  2.800966 2.909499 1.418964
H  4.31256 2.23145 -1.211642
H  5.048299 2.976561 0.227491
H  -1.61766 0.51599 1.553223
H  1.694314 2.074604 -1.380208
H  4.47042 0.838787 1.580799
H  -0.481552 0.875946 -1.304909
H  0.637568 1.73827 1.517324
H  4.780938 -0.161152 -1.339569
H  4.978959 -1.611577 1.443179
H  5.281369 -2.594143 -1.48167
H  5.478462 -4.028236 1.300907
H  4.761144 -4.773868 -0.160193
H  6.50338 -4.4326 -0.110905
