program: Gaussian 09
title: 000156631
version: EM64L-G09RevD.01
frameworkgroup: C1[X(C12H11ClN2S)]
method: RPBEPBE
basis: SDD
operation: Freq
keyword: #p
keyword: freq=noraman
keyword: PBEPBE/SDD
title: #p freq=noraman PBEPBE/SDD
converged: YES YES NO NO
title: Mulliken charges:
elementType: Cl S N N C C C C C C C C C C C C H H H H H H H H H H H
charge: -0.072847 0.225801 -0.409446 -0.579494 -0.287093 0.466002 -0.190224 -0.182693 -0.192574 -0.417049 -0.367264 -0.138143 -0.231176 -0.231074 -0.206735 -0.092156 0.253827 0.252612 0.218985 0.268492 0.262422 0.244208 0.253038 0.254894 0.287749 0.305039 0.304898
chargesum: 0.00000
title: Mulliken charges with hydrogens summed into heavy atoms:
elementType: Cl S N N C C C C C C C C C C C C
charge: -0.072847 0.225801 -0.121697 0.030444 -0.287093 0.466002 -0.190224 0.071134 0.060038 -0.198063 -0.098771 0.124279 0.013032 0.021964 0.048158 -0.092156
polarizability: 2.71009626e+02 1.51193493e+01 1.53380780e+02 1.72482068e+00 -1.14813542e+00 1.10711665e+02
1716.lowfreq: -11.0806 -4.2088 -0.0020 0.0020 0.0025 3.8411 12.2500 29.4676 36.2811
frequency: 10.1580 29.4453 36.2597 86.6165 90.4532 141.4990 176.2571 192.4265 263.5011 275.1249 281.4620 289.2771 302.6530 309.8662 347.2743 406.5306 412.5833 416.8453 477.6301 490.7309 514.6491 531.3618 572.6237 620.2341 625.6071 659.1539 692.4452 706.7971 718.4594 812.8821 813.7533 815.9201 823.9467 848.9541 942.2069 946.4157 960.2898 973.6536 985.2556 989.6494 1057.2940 1070.5952 1079.4704 1097.7532 1107.2821 1164.8434 1176.1025 1182.6300 1216.2066 1280.7046 1287.0383 1317.8063 1353.8882 1356.7834 1387.6720 1415.3506 1456.6858 1474.6785 1489.9381 1577.1352 1579.9853 1581.2150 1607.6298 1659.3131 3115.1197 3138.4802 3145.7069 3149.1647 3155.1804 3169.2492 3172.1781 3175.3037 3468.4810 3482.8921 3615.3875
redmass: 4.2188 5.2753 4.3385 4.0212 9.3466 5.8524 5.9693 6.9378 1.4357 4.2172 4.4204 3.0809 1.5506 4.7930 10.4257 2.9387 5.0984 3.5785 3.0045 6.6140 3.1676 4.4603 1.1470 7.1527 7.0842 6.8660 3.9326 6.9427 3.4607 1.6178 3.7229 1.3723 1.3166 1.4526 1.3233 1.3359 1.3521 1.3291 4.2308 4.7108 3.7336 2.7039 2.6776 1.4491 1.3526 1.9508 1.5281 1.1255 1.1860 1.2620 1.2412 2.4732 4.0657 4.6106 4.2291 4.8895 2.1350 1.7265 2.4798 7.4735 6.3929 4.4424 4.3678 1.2073 1.0887 1.0894 1.0894 1.0881 1.0952 1.0957 1.0967 1.0949 1.0676 1.0480 1.1079
irintensity: 0.2268 1.0731 0.9494 11.1866 0.7812 2.4143 0.8712 0.4416 50.5600 12.3316 21.1147 37.6913 278.1428 17.6635 8.3763 0.1572 3.7662 2.2102 25.6269 27.5092 6.6337 3.0082 64.0968 0.1161 0.1215 2.8787 0.0642 6.1901 0.0831 50.6689 6.8154 24.6067 17.6800 46.3681 0.1984 0.3119 0.3446 1.2258 44.9919 46.1255 17.2317 31.3358 16.4916 12.6392 4.7791 56.5405 2.9104 2.2748 1.8975 2.0474 1.2443 16.2149 21.5032 2.3837 2.0347 1.0106 147.6262 20.6303 134.8369 2.6994 9.3663 2.2858 144.2431 55.1105 21.0907 4.7010 4.1779 0.2987 7.3568 6.7599 3.5874 2.7157 22.4855 19.5202 5.1437
temp: 298.150 k
press: 1.00000 atm
elementType: 17 16 7 7 6 6 6 6 6 6 6 6 6 6 6 6 1 1 1 1 1 1 1 1 1 1 1
symmnumber: 1
zpe: 528486.2 jmol-1
zpe.correction: 0.201290 hartree
zpe.thermalcorrener: 0.216748 hartree
zpe.thermalcorrenthalpy: 0.217692 hartree
zpe.thermalcorrgfe: 0.155499 hartree
zpe.sumelectzpe: -1430.327878 hartree
zpe.sumelectthermal: -1430.312420 hartree
zpe.sumelectthermalent: -1430.311476 hartree
zpe.sumelectthermalfe: -1430.373669 hartree
dipole: -6.3035 -2.1239 0.7329
dipole: 6.6920
quadrupole: -83.5966 -104.9349 -104.7173
quadrupole: 21.5937 -2.5230 -0.2325
quadrupole: 14.1530 -7.1853 -6.9677 21.5937 -2.5230 -0.2325
hfenergy: -1430.5291681 hartree
pointgroup: C01 [X(C12H11Cl1N2S1)]
dipole: -2.4934918 -0.6146751 0.5800431 debye
polarizability: 270.4744684|17.9152329|140.8847528|0.4350213|-19.1728398|123.7428503 unknown
InChI: InChI=1S/C12H11ClN2S/c13-9-1-5-11(6-2-9)16-12-7-3-10(15-14)4-8-12/h1-8,15H,14H2
charge 0 multiplicity 1
27 atoms
Cl 5.53206 -1.381256 1.201945
S  0.438309 1.745763 -1.304957
N  -4.561813 -1.006238 0.800672
N  -5.229539 -2.008374 0.102698
C  -1.037821 0.867687 -0.647509
C  -3.397327 -0.400622 0.304453
C  1.840969 0.80772 -0.554717
C  -1.601789 1.253113 0.593059
C  -1.661987 -0.148585 -1.409812
C  -2.767819 0.625948 1.070077
C  -2.831303 -0.781993 -0.944079
C  1.66642 -0.352681 0.233926
C  3.14692 1.29956 -0.806853
C  2.789803 -1.02168 0.77153
C  4.274061 0.635812 -0.275161
C  4.077255 -0.518076 0.508721
H  -1.12542 2.044475 1.18108
H  -1.228741 -0.442112 -2.37189
H  -3.196349 0.933311 2.032599
H  -3.323514 -1.56699 -1.524159
H  0.66156 -0.738479 0.431974
H  3.291215 2.199696 -1.414622
H  2.658089 -1.919748 1.382212
H  5.282284 1.013799 -0.467848
H  -4.926602 -0.686476 1.702722
H  -6.10462 -1.751627 -0.355499
H  -5.1417 -2.960448 0.459539
