program: Gaussian 09
title: 000156618
version: EM64L-G09RevD.01
frameworkgroup: C1[X(C20H22N2O4)]
method: RPBEPBE
basis: SDD
operation: Freq
keyword: #p
keyword: freq=noraman
keyword: PBEPBE/SDD
title: #p freq=noraman PBEPBE/SDD
converged: YES YES NO NO
title: Mulliken charges:
elementType: O O O O N N C C C C C C C C C C C C C C C C C C C C H H H H H H H H H H H H H H H H H H H H H H
charge: -0.252449 -0.311412 -0.229893 -0.199205 -0.046257 -0.438367 -0.358127 -0.360695 -0.398424 -0.391374 -0.399479 -0.486907 0.146098 0.189656 -0.083250 0.222564 0.140733 0.251215 0.284273 -0.389209 -0.387118 0.373071 -0.801157 -0.483398 0.132350 -0.809608 0.229887 0.174781 0.169583 0.210504 0.213784 0.191110 0.208846 0.191036 0.213826 0.189265 0.202868 0.239307 0.368425 0.257435 0.249839 0.237614 0.319566 0.235199 0.254942 0.242921 0.242264 0.243365
chargesum: 0.00000
title: Mulliken charges with hydrogens summed into heavy atoms:
elementType: O O O O N N C C C C C C C C C C C C C C C C C C C C
charge: -0.252449 -0.311412 -0.229893 -0.199205 -0.046257 -0.069942 0.046542 0.019392 0.006469 0.008508 0.003613 -0.044732 0.146098 0.189656 -0.083250 0.222564 0.140733 0.251215 0.284273 -0.131774 -0.137280 0.373071 -0.008777 -0.228456 0.132350 -0.081058
polarizability: 3.27732350e+02 -7.17772023e+00 3.07461110e+02 2.38565449e+01 1.14750950e+01 1.50292130e+02
1716.lowfreq: -8.9308 -2.3753 0.0006 0.0009 0.0010 4.5196 12.8954 20.2487 27.2789
frequency: 12.6206 19.3675 27.2408 38.6503 64.1600 77.8825 80.3533 108.3560 148.9672 152.4667 160.5723 171.9011 186.9878 192.2344 205.6299 215.8038 230.3582 246.6177 282.3081 289.2226 292.0895 319.5631 322.3860 351.1414 374.7729 383.9288 394.6478 420.9605 434.9716 447.7830 506.7462 515.7798 519.1344 541.3028 547.4229 552.7681 577.5920 601.3377 616.4250 648.3074 666.9831 693.3982 696.2537 732.1177 748.3503 765.5710 775.8121 779.9967 783.6634 799.6498 805.9546 806.4236 854.1211 855.7766 870.8912 898.8780 914.3630 932.6521 943.2993 957.4472 981.7453 992.8925 1002.8806 1026.3684 1030.8034 1045.2031 1050.5406 1051.5994 1081.4764 1109.5856 1112.0968 1123.5471 1131.0382 1136.3981 1154.5939 1166.2809 1172.6334 1194.4648 1205.3267 1233.4576 1246.9106 1260.6070 1263.3826 1265.9228 1288.5790 1297.1397 1331.4129 1338.1408 1342.0515 1344.0949 1351.9377 1368.9852 1379.9388 1395.6819 1397.2781 1399.8997 1410.7276 1445.6372 1450.5746 1454.9600 1461.2200 1461.8932 1463.9080 1465.0353 1466.5073 1468.1040 1471.6351 1476.9055 1478.3393 1535.5631 1575.3386 1607.9866 1616.1365 1626.0570 1642.5451 1695.5395 2798.6156 2815.3725 2830.4951 2965.1367 2975.6171 2982.6526 2986.3435 2989.4707 3005.0007 3017.2829 3029.2340 3035.3021 3048.5396 3054.7908 3057.2597 3059.7682 3104.5509 3115.4060 3160.6407 3172.4142 3185.6566 3440.0467
redmass: 5.5436 3.8639 5.3450 3.4554 3.7361 5.2429 5.1179 4.1305 2.1895 3.7909 1.4856 1.7942 3.1801 4.0172 2.3116 4.6968 2.4950 2.6837 5.5474 2.9179 2.5661 5.3889 3.6223 3.0809 1.9142 6.4717 5.1644 7.2859 3.4537 2.9526 5.6397 4.5652 4.0603 2.2698 4.8656 5.0905 3.8855 4.3201 5.0745 4.8348 5.5823 4.1690 6.1422 5.3612 1.9062 6.3510 2.8624 3.0816 7.1469 4.2538 1.6873 1.5435 1.5813 2.3550 1.3845 3.0507 2.8866 3.3372 1.3165 1.2966 2.0065 2.0717 2.3144 5.4269 3.1623 1.5864 2.0396 1.4428 1.3883 3.1843 2.7052 2.5718 2.5262 1.7192 1.3102 2.5771 2.7726 1.4646 2.7185 2.8746 1.4582 1.4003 3.1325 1.2050 1.6343 1.4536 1.3024 2.5617 1.4277 1.5241 1.4669 1.4211 2.7065 1.3526 1.3791 1.4423 3.7626 1.0970 1.0927 1.3169 1.0872 2.4758 1.1396 1.0575 1.0967 1.4139 2.1004 1.0661 1.0995 2.3651 6.4781 8.1940 9.1089 9.0391 4.1024 10.3382 1.0713 1.0715 1.0698 1.0630 1.0392 1.0382 1.0621 1.0612 1.0841 1.0865 1.0901 1.0935 1.1035 1.0952 1.1035 1.0969 1.0986 1.0986 1.0881 1.0918 1.0970 1.0779
irintensity: 2.8058 0.0842 2.1143 0.4733 4.0630 2.5654 2.5902 1.5188 0.3854 0.5891 0.5688 1.1027 0.2473 0.2431 1.6498 2.6299 0.3797 1.6404 2.8482 1.8967 2.9222 3.6299 2.4959 4.1554 3.6092 5.6327 2.3839 3.7607 2.7718 0.2136 4.7425 6.5760 1.5746 1.5027 7.5340 6.4255 14.7381 2.6911 1.1050 0.9196 11.8404 6.3426 1.3090 36.2154 29.9947 12.6692 30.6223 18.1472 5.6928 40.2513 12.2599 28.9050 2.8309 8.5210 35.9402 11.1845 16.9372 17.0716 0.0747 3.1096 12.5304 15.8119 11.5769 106.6537 11.3598 8.2246 3.9999 16.4256 8.5047 26.4171 16.3066 11.5882 26.6472 18.6965 6.4334 77.9278 24.2548 8.0329 21.2149 33.1924 25.6298 6.3284 60.4103 4.5145 33.8674 8.5167 4.7390 13.6701 0.0099 6.7385 0.4453 2.8787 92.3629 7.4061 3.6030 20.8904 187.1986 20.7014 4.0979 2.2931 13.1489 56.1355 5.1725 16.1406 15.3047 37.8227 91.3386 13.5074 9.0408 355.7763 9.4658 15.2024 164.2715 2.2161 127.1190 539.0957 93.5841 49.3654 164.7614 38.4167 42.0404 11.6561 32.3739 31.7854 12.4838 69.4477 69.3071 33.2458 21.1668 14.8852 78.0663 10.9424 21.2560 7.5974 1.9622 1.7973 5.2621 81.1735
temp: 298.150 k
press: 1.00000 atm
elementType: 8 8 8 8 7 7 6 6 6 6 6 6 6 6 6 6 6 6 6 6 6 6 6 6 6 6 1 1 1 1 1 1 1 1 1 1 1 1 1 1 1 1 1 1 1 1 1 1
symmnumber: 1
zpe: 1010494.4 jmol-1
zpe.correction: 0.384877 hartree
zpe.thermalcorrener: 0.408539 hartree
zpe.thermalcorrenthalpy: 0.409483 hartree
zpe.thermalcorrgfe: 0.329624 hartree
zpe.sumelectzpe: -1183.844799 hartree
zpe.sumelectthermal: -1183.821137 hartree
zpe.sumelectthermalent: -1183.820192 hartree
zpe.sumelectthermalfe: -1183.900052 hartree
dipole: 5.3939 -1.3260 0.5862
dipole: 5.5853
quadrupole: -122.0866 -161.8294 -151.5902
quadrupole: 0.2046 4.7656 -3.7345
quadrupole: 23.0821 -16.6607 -6.4215 0.2046 4.7656 -3.7345
hfenergy: -1184.2296756 hartree
pointgroup: C01 [X(C20H22N2O4)]
dipole: -2.1581149 -0.2227269 -0.3488184 debye
polarizability: 327.6158195|-0.9110598|304.6078727|27.962348|20.7422214|153.2618976 unknown
InChI: InChI=1S/C20H22N2O4/c1-12-10-17(24)26-20-14(12)6-7-15-18(20)19(13(2)25-15)21-16(23)11-22-8-4-3-5-9-22/h6-7,10,21H,3-5,8-9,11H2,1-2H3
charge 0 multiplicity 1
48 atoms
O  -1.620268 3.531856 0.477472
O  -1.347811 -1.126086 0.094962
O  2.741171 2.026602 0.83633
O  -1.05304 -3.411334 -0.038935
N  4.155972 -0.531564 0.338202
N  0.791593 0.724765 0.775262
C  3.903123 -0.58798 -1.122767
C  5.024515 -1.637905 0.809519
C  5.225704 -0.556904 -1.91389
C  6.377001 -1.629769 0.069192
C  6.163987 -1.69803 -1.460134
C  2.920033 -0.428029 1.12267
C  2.170284 0.901408 0.88618
C  -0.232978 1.687061 0.620985
C  -1.573567 1.253404 0.250006
C  -2.387208 2.408562 0.168481
C  -2.166754 0.002119 -0.015224
C  -0.279977 3.075498 0.767431
C  -3.544051 -0.086747 -0.368125
C  -3.752502 2.382539 -0.175522
C  -4.314252 1.122659 -0.442965
C  -4.091712 -1.414756 -0.632982
C  0.643365 4.170846 1.176027
C  -3.271729 -2.527624 -0.529072
C  -1.866458 -2.47699 -0.163291
C  -5.545667 -1.572599 -1.018702
H  3.281456 0.282778 -1.400974
H  3.329313 -1.515026 -1.39446
H  4.531885 -2.63631 0.657382
H  5.185911 -1.51287 1.897286
H  5.717692 0.419091 -1.740236
H  5.006252 -0.636702 -2.995984
H  6.915691 -0.697198 0.32525
H  6.991067 -2.482097 0.418705
H  7.134127 -1.635889 -1.988537
H  5.712132 -2.676501 -1.726735
H  2.219082 -1.288858 0.94227
H  3.187869 -0.458437 2.197701
H  0.45398 -0.24426 0.710347
H  -4.341494 3.301118 -0.228793
H  -5.372221 1.060704 -0.713294
H  0.52223 5.0420 0.507124
H  1.681805 3.811106 1.13425
H  0.422504 4.511173 2.206334
H  -3.66033 -3.53092 -0.723617
H  -6.212345 -1.179236 -0.228536
H  -5.800037 -2.631259 -1.185679
H  -5.774745 -1.01391 -1.945513
