program: Gaussian 09
title: 000156593
version: EM64L-G09RevD.01
frameworkgroup: C1[X(C17H17NO5)]
method: RPBEPBE
basis: SDD
operation: Freq
keyword: #p
keyword: freq=noraman
keyword: PBEPBE/SDD
title: #p freq=noraman PBEPBE/SDD
converged: YES YES NO NO
title: Mulliken charges:
elementType: O O O O O N C C C C C C C C C C C C C C C C C H H H H H H H H H H H H H H H H H
charge: -0.310999 -0.283049 -0.293601 -0.296014 -0.267751 -0.473716 0.170731 0.230787 0.251435 0.163282 0.064495 -0.051885 0.032362 0.135607 0.050918 -0.393024 -0.363808 -0.210727 -0.265593 -0.519381 -0.514994 -0.520899 -0.519817 0.342039 0.235059 0.280962 0.228907 0.231906 0.274646 0.228141 0.217060 0.224150 0.276841 0.209713 0.221530 0.226703 0.275513 0.223618 0.217991 0.270860
chargesum: 0.00000
title: Mulliken charges with hydrogens summed into heavy atoms:
elementType: O O O O O N C C C C C C C C C C C C C C C C C
charge: -0.310999 -0.283049 -0.293601 -0.296014 -0.267751 -0.131676 0.170731 0.230787 0.251435 0.163282 0.064495 -0.051885 0.032362 0.135607 0.050918 -0.157965 -0.082846 0.018180 -0.033687 0.200465 0.195710 0.202847 0.192653
polarizability: 3.43809718e+02 3.70095814e+00 2.49581875e+02 1.41548771e+00 -1.51270717e+00 1.07480018e+02
1716.lowfreq: -5.4792 -2.6173 -0.0005 0.0004 0.0010 4.9536 32.6183 42.7893 63.2294
frequency: 32.5861 42.7710 63.2093 81.5660 86.4001 93.2021 103.7191 113.3044 133.4633 145.9038 150.8099 157.3428 169.6600 174.2116 186.4460 199.5359 224.0051 262.9177 282.5683 291.9704 295.7080 309.4649 317.9989 342.1268 363.5393 377.5569 404.5519 433.5165 449.8558 503.0612 504.8125 521.4491 540.7947 582.4746 611.6421 637.3351 643.5259 691.9126 711.0612 722.8029 738.3264 755.9934 769.5714 791.7459 838.1056 841.9941 872.4630 875.0260 884.3552 929.2694 936.7382 967.3762 998.8141 1005.5580 1022.4837 1035.9824 1092.2482 1101.1779 1106.3542 1109.2667 1109.5097 1115.4140 1117.3557 1154.7882 1155.7730 1156.9247 1158.4817 1168.7084 1197.4351 1245.9513 1272.0769 1287.0971 1317.1401 1356.7111 1381.2394 1391.3386 1409.5552 1414.7516 1422.7121 1433.1491 1438.2098 1443.7434 1450.5143 1455.1784 1456.2181 1457.8467 1477.5521 1484.3452 1485.9538 1486.9300 1487.6260 1512.0033 1530.8343 1559.3700 1589.3659 1602.5387 1625.8090 2976.5631 2977.8373 2979.6869 2983.8354 3086.3196 3089.6138 3092.0385 3093.5938 3122.0608 3122.9600 3125.5682 3131.7754 3133.2241 3140.1742 3153.7925 3169.3624 3505.7669
redmass: 4.7832 4.0473 3.2873 3.4224 3.1461 2.6768 2.3592 2.6501 1.9324 1.3269 1.7793 1.7650 1.4444 2.1244 2.7016 2.5324 4.4216 5.6148 5.0873 6.2459 6.4640 5.7119 6.4212 7.1605 7.3208 6.6305 5.4994 6.1189 4.5803 6.2519 8.7932 5.8257 3.7580 7.2608 7.7255 5.5187 6.2416 2.4759 4.4556 1.7881 6.7372 7.5078 1.6983 3.1866 7.3405 6.3899 1.6398 7.2954 5.9877 9.2723 9.2328 1.3625 1.3298 7.4190 4.8135 2.6669 3.7136 1.2747 1.2938 2.4927 1.3121 1.5959 1.9479 1.3881 1.3743 1.4166 1.4623 1.0780 2.8398 2.5201 2.3153 2.4881 5.5629 3.6357 2.7252 2.4872 2.9603 1.5235 1.3971 1.3436 1.6017 1.9633 1.0926 1.0957 1.0789 1.1476 2.6046 1.0559 1.0558 1.0641 1.0553 5.7566 9.7558 6.7029 8.9015 5.6078 6.8680 1.0311 1.0319 1.0338 1.0318 1.1009 1.1022 1.0982 1.1010 1.0873 1.1039 1.1047 1.1052 1.1056 1.0892 1.0935 1.0999 1.0764
irintensity: 3.9493 0.3581 2.5006 0.9714 6.6698 6.2167 4.7387 1.0939 1.1735 0.7440 0.9434 2.5746 1.5342 2.5526 2.4483 5.1039 13.8938 4.5663 20.9374 0.8777 3.1886 5.2296 1.7229 0.2526 7.8635 10.2497 0.7219 2.0812 6.5565 1.6566 1.8213 1.2504 7.7278 2.0067 26.5486 21.3714 3.5788 9.7156 13.7361 15.2667 11.9834 5.5127 114.3012 24.9596 12.5127 16.3966 1.4533 3.8399 2.3935 47.2628 55.4761 2.7128 0.5350 64.9920 172.8738 109.0178 39.2476 20.0440 10.3642 40.9686 25.9346 20.4111 45.4909 2.7895 10.1465 11.9499 14.2781 5.4503 15.6920 57.0934 2.1724 15.6541 156.4446 104.9306 98.7600 41.0095 35.7819 1.7235 45.3571 41.3627 42.4243 47.2893 5.8830 6.2667 8.6747 16.4622 21.0023 15.5651 17.5622 13.2469 30.4206 162.2851 255.1997 5.7316 155.2706 214.4703 133.6884 102.6768 72.7487 79.0977 90.7258 28.5777 17.5220 34.1735 25.7936 4.4400 15.4601 20.7282 13.0171 9.6845 12.5622 9.1785 33.5709 87.6571
temp: 298.150 k
press: 1.00000 atm
elementType: 8 8 8 8 8 7 6 6 6 6 6 6 6 6 6 6 6 6 6 6 6 6 6 1 1 1 1 1 1 1 1 1 1 1 1 1 1 1 1 1
symmnumber: 1
zpe: 809440.9 jmol-1
zpe.correction: 0.308300 hartree
zpe.thermalcorrener: 0.330516 hartree
zpe.thermalcorrenthalpy: 0.331460 hartree
zpe.thermalcorrgfe: 0.257289 hartree
zpe.sumelectzpe: -1087.163652 hartree
zpe.sumelectthermal: -1087.141435 hartree
zpe.sumelectthermalent: -1087.140491 hartree
zpe.sumelectthermalfe: -1087.214663 hartree
dipole: -1.6096 4.2522 -0.2370
dipole: 4.5528
quadrupole: -113.9772 -124.3724 -132.8966
quadrupole: 7.7779 -0.5381 4.8462
quadrupole: 9.7716 -0.6237 -9.1479 7.7779 -0.5381 4.8462
hfenergy: -1087.4719514 hartree
pointgroup: C01 [X(C17H17N1O5)]
dipole: 0.5665955 -1.6987059 -0.0431678 debye
polarizability: 343.959155|-0.0741176|249.4089737|-0.8996386|-2.5300082|107.5034822 unknown
InChI: InChI=1S/C17H17NO5/c1-20-14-11-12(15(21-2)17(23-4)16(14)22-3)18-10-8-6-5-7-9(10)13(11)19/h5-8,18H,1-4H3
charge 0 multiplicity 1
40 atoms
O  0.772388 -2.994451 -0.160851
O  1.390998 2.617539 0.129376
O  3.392259 -1.813662 -0.028513
O  3.627319 1.01719 0.049221
O  -1.478797 2.6719 0.019923
N  -1.400756 -1.482518 -0.082866
C  -0.188364 -0.800435 -0.054754
C  -0.135735 0.63295 -0.033554
C  -2.633386 -0.842247 -0.044276
C  -2.663991 0.584097 0.013768
C  -1.413592 1.393533 0.003365
C  0.990661 -1.602037 -0.059326
C  1.169738 1.23911 0.005094
C  2.257667 -0.987641 -0.042459
C  2.340766 0.439446 0.02712
C  -3.844326 -1.59056 -0.058693
C  -3.924562 1.23776 0.063522
C  -5.074974 -0.917854 -0.009169
C  -5.120906 0.503991 0.054056
C  1.434219 -3.85078 0.854496
C  1.130297 3.453018 -1.065807
C  4.390452 -1.582449 -1.103255
C  3.969875 1.736445 1.300794
H  -1.329809 -2.503199 -0.13578
H  -3.80834 -2.685481 -0.106161
H  -3.917557 2.331736 0.106548
H  -6.00671 -1.494495 -0.018864
H  -6.086407 1.0185 0.093167
H  2.527721 -3.745331 0.783442
H  1.120526 -4.877296 0.610763
H  1.089418 -3.575967 1.869751
H  1.506325 4.452336 -0.798095
H  0.046134 3.495179 -1.258072
H  1.690478 3.055653 -1.933279
H  3.93508 -1.798578 -2.087734
H  5.200514 -2.298054 -0.896452
H  4.760161 -0.545698 -1.063574
H  4.985866 2.128786 1.140208
H  3.965193 1.033444 2.155273
H  3.256359 2.559919 1.468448
