program: Gaussian 09
title: 000156554
version: EM64L-G09RevD.01
frameworkgroup: C1[X(C9H15Br)]
method: RPBEPBE
basis: SDD
operation: Freq
keyword: #pfreq=noraman
keyword: PBEPBE/SDD
title: #p freq=noraman PBEPBE/SDD
converged: YES YES NO NO
title: Mulliken charges:
elementType: Br C C C C C C C C C H H H H H H H H H H H H H H H
charge: -0.030439 -0.359614 -0.355655 -0.354828 -0.355004 -0.444675 -0.694945 -0.224071 0.230714 -0.574668 0.191022 0.191633 0.189852 0.192841 0.210649 0.221605 0.195700 0.194653 0.233455 0.230237 0.210974 0.215951 0.209982 0.237064 0.237567
chargesum: 0.00000
title: Mulliken charges with hydrogens summed into heavy atoms:
elementType: Br C C C C C C C C C
charge: -0.030439 0.023041 0.027038 0.077426 0.035348 0.019016 -0.058038 -0.224071 0.230714 -0.100037
polarizability: 1.39643811e+02 2.01819263e+01 1.34565954e+02 -8.39971709e+00 -5.10838261e+00 8.12196397e+01
1716.lowfreq: -0.0007 -0.0005 0.0001 3.1900 10.0600 11.7523 32.2956 51.8074 62.6529
frequency: 31.8464 51.2509 62.6067 80.1624 120.0738 120.8538 140.3685 154.6119 229.7299 241.6942 254.0921 294.4003 372.2739 383.8281 441.1256 516.4694 578.5695 597.1259 723.8275 740.0543 788.6036 870.1908 888.3338 900.5217 929.5317 985.2071 999.9339 1013.3225 1019.9641 1065.3365 1079.7084 1113.1182 1116.4106 1191.5576 1225.7197 1235.5101 1258.0282 1278.5385 1286.3798 1291.2639 1296.1149 1325.3726 1348.4777 1356.1052 1391.0920 1445.2606 1446.0130 1464.3273 1465.4513 1473.8405 1477.5970 1482.0785 1488.6802 2009.1693 2952.0168 2957.3262 2968.2565 2972.1944 2974.8375 2985.7308 2989.6407 3005.4843 3025.6945 3033.8633 3057.7593 3068.7180 3070.1787 3071.1502 3163.5819
redmass: 4.4390 1.6537 3.4902 3.1310 2.7712 2.1631 2.2673 3.5002 1.1393 3.2079 2.9783 3.3830 3.3768 7.2221 3.1991 4.8746 1.1543 3.2311 1.0652 1.1110 1.2158 1.3943 1.8741 1.3389 2.5867 1.2987 1.4916 3.2151 3.5015 2.7354 2.2596 1.6566 2.1612 1.6768 1.3521 1.4901 1.4756 1.1683 1.1606 1.2056 1.1873 1.4351 1.4971 1.6529 1.2166 1.2800 1.1674 1.0671 1.0769 1.0706 1.0424 1.0796 1.0915 10.4608 1.0589 1.0589 1.0589 1.0367 1.0588 1.0620 1.0947 1.1008 1.1014 1.1038 1.1045 1.1007 1.0600 1.0993 1.1134
irintensity: 0.3337 0.0852 0.0169 0.2275 0.1040 0.2043 0.0179 0.9312 0.0789 2.6606 5.9379 0.2465 0.7316 10.8171 0.4880 9.3360 7.4644 32.0832 12.7437 0.8182 5.9631 1.7827 3.6250 59.5403 55.9829 19.7451 0.9511 5.5452 1.7195 0.9623 0.3534 27.4866 15.8092 1.8087 1.7570 4.6903 8.8585 0.2519 0.3087 1.5337 5.8684 2.0054 0.9055 0.8496 11.1360 16.8078 7.2353 0.0881 0.5722 2.1608 12.3985 2.6152 25.0394 6.0573 4.5178 9.9287 83.8969 34.6109 1.9885 57.0920 6.4366 1.3326 13.5600 23.7913 59.5697 99.9843 8.0461 53.7216 5.2481
temp: 298.150 k
press: 1.00000 atm
elementType: 35 6 6 6 6 6 6 6 6 6 1 1 1 1 1 1 1 1 1 1 1 1 1 1 1
symmnumber: 1
zpe: 558884.3 jmol-1
zpe.correction: 0.212868 hartree
zpe.thermalcorrener: 0.226016 hartree
zpe.thermalcorrenthalpy: 0.226960 hartree
zpe.thermalcorrgfe: 0.170778 hartree
zpe.sumelectzpe: -364.558247 hartree
zpe.sumelectthermal: -364.545099 hartree
zpe.sumelectthermalent: -364.544155 hartree
zpe.sumelectthermalfe: -364.600337 hartree
dipole: -1.0670 2.0299 0.2365
dipole: 2.3054
quadrupole: -72.4401 -68.3939 -72.0319
quadrupole: 6.4249 -1.0439 -1.1883
quadrupole: -1.4848 2.5614 -1.0766 6.4249 -1.0439 -1.1883
hfenergy: -364.7711149 hartree
pointgroup: C01 [X(C9H15Br1)]
dipole: 0.3058253 -0.7262423 0.4491436 debye
dipolederiv: -0.1728661 0.0527053 -0.0735698 -0.0508296 -0.6333584 0.2723832 -0.0354315 0.335528 -0.2577423 -0.0586273 0.0082289 0.0173811 0.010402 0.1862748 -0.0082235 0.0973982 0.0048499 0.1061955 -0.0664578 0.0054351 -0.0029048 0.0029966 0.176514 -0.0058213 -0.0817904 -0.0113642 0.0693506 -0.0039374 -0.0102151 -0.0076838 0.009721 0.1520848 -0.0076391 -0.1318598 -0.0235433 0.0425688 0.0282463 0.0062575 0.0109526 0.0123868 0.1745433 -0.0053456 0.0858174 -0.0046811 0.101906 -0.0313958 -0.0318854 -0.0099221 0.0200273 -0.0677088 0.149306 -0.0290638 0.1753078 0.0366046 -0.0816826 0.0089879 0.0508046 0.0080043 0.093782 -0.0046547 0.0067561 -0.0049789 0.0463408 0.2270917 0.042274 0.2057837 0.051782 0.9325777 -0.5445055 0.2944144 -0.6084396 0.2414095 -0.0932273 0.0951733 -0.0189937 0.2128884 -0.1661255 0.1044155 -0.1177324 0.0818791 -0.1816835 -0.1756512 -0.0097011 -0.1718326 -0.0699516 -0.173065 0.1788336 -0.1585221 0.1937706 -0.0153915 0.0367285 -0.0074175 0.0060261 0.0040802 -0.0663211 0.1411548 -0.0065922 0.1105741 -0.063669 0.0400883 -0.0056132 -0.0077645 -0.0092284 -0.1058963 -0.1354729 -0.0071722 -0.105784 -0.0291859 0.0365372 -0.0169189 -0.0144004 -0.0108766 -0.1054174 -0.1357636 -0.0029404 -0.1093488 -0.0270332 0.0393368 0.0076167 -0.0042451 0.0018 -0.0690262 0.1408157 0.0032506 0.1135468 -0.0588372 0.0361202 -0.0079768 -0.0031052 -0.0056712 -0.0850186 -0.1214028 0.0008604 -0.0966736 -0.0121012 0.0758173 -0.0004601 0.0088172 -0.0098509 -0.0395982 0.1160488 0.0055487 0.0860845 -0.0269725 0.0307145 0.0143759 0.0123448 -0.014058 -0.1091236 -0.148259 -0.0118463 -0.1187284 -0.0306477 0.0284261 -0.0218551 0.0282585 0.0031236 -0.0705084 0.1522476 -0.0036889 0.1247149 -0.0673607 0.0067846 -0.051523 -0.032921 -0.0157062 -0.0517473 -0.1216968 -0.0163373 -0.1039571 0.0236403 0.0220994 0.0492714 -0.0413476 -0.0167429 -0.0280634 0.1192821 0.0001828 0.1070289 -0.0114681 0.0840353 0.0227199 -0.0008385 -0.0228018 -0.0704436 0.1427381 0.0506119 0.1215686 -0.0361591 -0.199366 0.0045485 -0.0893972 0.0043178 0.0992318 -0.0019106 -0.1240725 -0.0006653 0.0157664 0.0823652 -0.0364569 -0.0083066 0.0149503 -0.1060811 -0.1337946 0.0388629 -0.1156221 -0.0019036 0.1033839 -0.0552577 0.0384493 -0.079488 0.0242112 -0.1044982 0.0319985 -0.1193064 0.0679067 0.0054363 -0.0623133 0.1084151 -0.0512751 0.1082832 -0.0382375 0.1113479 -0.0317604 0.0684661 unknown
polarizability: 144.5169224|21.3357271|124.0780274|1.5705027|-15.44121|86.8344545 unknown
InChI: InChI=1S/C9H15Br/c1-3-5-6-7-8-9(10)4-2/h2-3,5-8H2,1H3
charge 0 multiplicity 1
25 atoms
Br -2.708422 1.878586 -1.095232
C  1.503725 0.062657 0.550769
C  2.744505 -0.056182 -0.362813
C  0.173392 0.064321 -0.235258
C  4.078364 -0.061572 0.418904
C  -1.054849 0.187628 0.703283
C  5.313932 -0.177458 -0.499961
C  -2.387341 0.213834 -0.013569
C  -3.341896 -0.700936 -0.01545
C  -4.296419 -1.629299 -0.003653
H  1.503732 -0.775358 1.279195
H  1.578027 0.995655 1.148219
H  2.670823 -0.98553 -0.965623
H  2.748624 0.784638 -1.08737
H  0.084621 -0.86708 -0.828947
H  0.167581 0.904068 -0.956633
H  4.150435 0.866622 1.0221
H  4.073247 -0.902742 1.142098
H  -0.95559 1.107177 1.314029
H  -1.070188 -0.670488 1.403717
H  5.357574 0.667527 -1.212895
H  6.253913 -0.177434 0.082137
H  5.282282 -1.112413 -1.090982
H  -4.314667 -2.443588 -0.740188
H  -5.103806 -1.614434 0.740522
