program: Gaussian 09
title: 000156532
version: EM64L-G09RevD.01
frameworkgroup: C1[X(C19H17NO6)]
method: RPBEPBE
basis: SDD
operation: Freq
keyword: #p
keyword: freq=noraman
keyword: PBEPBE/SDD
title: #p freq=noraman PBEPBE/SDD
converged: YES YES NO NO
title: Mulliken charges:
elementType: O O O O O O N C C C C C C C C C C C C C C C C C C C H H H H H H H H H H H H H H H H H
charge: -0.258883 -0.259735 -0.369216 -0.419330 -0.306856 -0.262479 -0.026454 0.419860 0.199589 -0.573167 -0.504328 -0.095796 -0.560498 -0.468111 0.175132 0.184478 0.157058 0.211589 -0.205630 0.075928 -0.311303 0.053637 0.225504 -0.386519 -0.522804 -0.493706 0.231070 0.229433 0.232541 0.236869 0.263095 0.319459 0.243723 0.236125 0.265877 0.255722 0.387666 0.281295 0.206087 0.226881 0.228392 0.226965 0.250841
chargesum: 0.00000
title: Mulliken charges with hydrogens summed into heavy atoms:
elementType: O O O O O O N C C C C C C C C C C C C C C C C C C C
charge: -0.258883 -0.259735 -0.369216 -0.031664 -0.306856 -0.262479 -0.026454 0.419860 0.199589 -0.112664 -0.034917 -0.095796 -0.297403 -0.148653 0.175132 0.184478 0.157058 0.211589 0.274219 0.075928 -0.045426 0.053637 0.225504 -0.130797 0.191459 0.212492
polarizability: 3.89037683e+02 -1.73692518e+01 2.54930711e+02 7.08460591e+00 -9.67187776e+00 1.45127130e+02
1716.lowfreq: -4.0721 -0.8060 -0.0012 -0.0008 -0.0006 6.9035 15.9932 24.4670 29.7067
frequency: 15.7136 24.3604 29.6832 47.6203 63.6316 81.3383 88.7169 107.0054 115.7569 122.2978 150.8582 155.9280 173.2402 201.0864 215.8718 225.4024 247.8082 252.8601 272.7129 285.2522 298.2398 312.2176 343.1145 348.2347 377.9945 397.4429 408.8897 415.5663 431.6012 454.3301 490.2417 526.0702 550.4187 555.4989 578.1139 596.9050 606.2647 618.8376 659.7672 674.8215 681.5686 707.0617 714.1759 728.4254 755.8887 765.2666 784.2756 794.5445 806.9758 831.9634 851.7909 870.0301 897.6873 909.5974 919.7844 935.5261 943.3975 952.8071 974.9103 995.4162 997.4439 1028.6772 1052.6191 1062.7902 1068.2005 1104.9346 1105.6733 1110.1585 1124.4710 1152.2330 1156.8346 1157.7923 1165.1272 1178.0099 1208.4646 1211.5015 1222.8587 1240.9443 1266.8178 1274.1251 1309.1430 1312.4845 1342.3635 1360.4979 1367.5341 1389.9945 1400.0622 1408.1214 1421.8742 1422.4414 1435.2652 1448.1778 1451.9717 1453.2710 1455.0725 1461.5646 1466.6248 1473.1037 1486.3752 1486.9053 1532.9445 1546.0466 1569.3283 1608.9864 1617.1429 1631.4117 2540.5567 2956.0966 2965.1262 2971.8522 3004.3691 3006.9867 3046.4900 3057.6961 3086.2559 3106.9674 3113.4383 3128.5170 3132.7746 3166.3264 3169.6647 3196.3312 3196.7746
redmass: 5.0743 3.6088 4.7062 5.3364 2.4266 1.9007 6.0597 5.9598 4.3649 4.5812 3.2742 1.9517 4.2407 3.0582 1.2718 4.1532 4.9544 4.1380 5.9636 4.4742 6.3218 5.3710 4.5901 5.2077 5.7701 6.6211 3.7755 5.8467 4.5013 5.1440 7.2995 5.7280 4.2749 4.8243 4.8639 7.1188 5.6285 5.8910 6.2268 7.1947 7.0783 5.5103 6.1077 4.3287 5.9418 5.4229 3.3304 5.0746 2.1260 6.8199 3.3871 1.4066 5.8401 1.4971 6.6483 2.4143 1.4656 5.7026 5.5583 2.7996 1.2050 2.4869 3.8037 2.9081 1.4801 2.3664 1.3922 1.2402 1.0589 1.3204 1.3337 1.3002 1.6603 1.8296 4.3138 1.7404 1.8804 1.4355 3.1991 4.0061 2.0141 1.9903 1.7379 1.4085 3.5595 5.1889 4.5136 2.4427 1.6002 4.2866 1.4202 1.1236 1.0814 1.1398 1.0614 1.0710 2.1353 2.0765 1.4712 1.0547 6.0479 7.5765 2.9211 8.7093 8.7652 3.7840 1.0760 1.0693 1.0640 1.0354 1.0287 1.0588 1.0944 1.0950 1.0960 1.1128 1.1042 1.1053 1.1062 1.0931 1.0888 1.0933 1.0959
irintensity: 1.9147 1.8832 0.2288 0.0293 14.5171 2.2904 4.2666 2.5299 4.0070 6.8563 1.1935 1.0078 1.2266 5.5219 0.9271 3.7667 2.3099 1.0444 2.3165 9.5153 1.2014 1.3645 2.8310 0.3809 1.5159 5.2147 4.4618 2.0010 16.4397 3.4089 13.5131 8.4424 2.4839 1.7295 26.2483 36.3248 12.5561 16.4499 21.3398 0.1158 1.5768 21.3050 0.1977 2.4981 5.1920 76.3689 24.1253 27.9591 22.1288 29.6994 5.3012 20.1452 37.6633 27.3646 6.1682 6.8578 3.3109 51.6679 193.6948 55.6689 84.6696 11.4432 174.2788 8.4911 11.5135 37.1065 5.0690 7.6017 0.6552 33.4979 48.5243 3.9911 19.9408 14.7699 142.8059 4.6867 15.8866 114.3388 124.9063 518.5876 46.6068 116.3516 45.1168 49.3343 135.6993 79.0518 56.1912 197.0911 145.5781 23.4228 25.3842 14.9870 10.2009 19.9643 14.8676 6.0410 226.0951 50.7433 50.6777 20.5556 44.9501 65.3100 61.9678 3.0525 13.6845 413.3463 440.5053 25.8607 37.3915 78.7213 90.4171 133.0236 33.0196 35.9047 36.5282 30.6390 34.7613 12.5710 21.2872 3.7769 1.3261 23.2925 3.4769
temp: 298.150 k
press: 1.00000 atm
elementType: 8 8 8 8 8 8 7 6 6 6 6 6 6 6 6 6 6 6 6 6 6 6 6 6 6 6 1 1 1 1 1 1 1 1 1 1 1 1 1 1 1 1 1
symmnumber: 1
zpe: 848974.3 jmol-1
zpe.correction: 0.323357 hartree
zpe.thermalcorrener: 0.346593 hartree
zpe.thermalcorrenthalpy: 0.347537 hartree
zpe.thermalcorrgfe: 0.268713 hartree
zpe.sumelectzpe: -1238.383998 hartree
zpe.sumelectthermal: -1238.360763 hartree
zpe.sumelectthermalent: -1238.359818 hartree
zpe.sumelectthermalfe: -1238.438642 hartree
dipole: 1.4005 0.3929 -3.5028
dipole: 3.7928
quadrupole: -119.8864 -137.0069 -155.1209
quadrupole: 5.9808 4.3736 5.0213
quadrupole: 17.4516 0.3312 -17.7828 5.9808 4.3736 5.0213
hfenergy: -1238.7073553 hartree
pointgroup: C01[X(C19H17N1O6)]
dipole: 0.6016261 -0.5044722 -1.2689617 debye
polarizability: 383.8359442|-21.2669005|229.1491118|24.4814145|-51.6490061|176.1104673 unknown
InChI: InChI=1S/C19H17NO6/c1-23-13-4-3-11(18(22)19(13)24-2)17(21)16-12-8-15-14(25-9-26-15)7-10(12)5-6-20-16/h3-4,7-8,22H,5-6,9H2,1-2H3
charge 0 multiplicity 1
43 atoms
O  5.888194 -1.68973 -0.218809
O  4.16827 -2.732925 1.091887
O  -0.210637 -0.36802 1.747645
O  -2.617619 -0.953417 1.673984
O  -5.128806 -0.795434 0.430856
O  -5.30122 0.841353 -2.026626
N  0.796043 2.382128 -0.040411
C  3.282652 0.985311 -0.644589
C  2.244046 0.363531 0.123116
C  2.981094 2.32383 -1.301663
C  2.023179 3.139534 -0.411618
C  0.944391 1.095784 0.2152
C  4.538749 0.35152 -0.819782
C  2.461908 -0.908678 0.741774
C  4.722072 -0.894517 -0.214348
C  3.704293 -1.504219 0.550329
C  -0.308936 0.375999 0.677783
C  -1.582275 0.495549 -0.018196
C  5.502509 -2.951195 0.481796
C  -2.727465 -0.209753 0.522826
C  -1.771229 1.266402 -1.209528
C  -4.000673 -0.155295 -0.117606
C  -4.144824 0.642137 -1.287607
C  -3.015995 1.341088 -1.822676
C  -5.022396 -2.254682 0.664731
C  -6.62369 0.317876 -1.625247
H  3.910591 2.891116 -1.488592
H  2.50219 2.152361 -2.289183
H  2.534871 3.433704 0.53018
H  1.702981 4.068518 -0.913836
H  5.334665 0.821378 -1.404032
H  1.69034 -1.364288 1.363484
H  6.236225 -3.153927 1.2773
H  5.435823 -3.763395 -0.265473
H  -0.925301 1.822493 -1.615402
H  -3.177509 1.934348 -2.726477
H  -1.613311 -0.87315 1.975442
H  -4.270512 -2.463653 1.441582
H  -4.75853 -2.779203 -0.274671
H  -6.025528 -2.560326 0.999929
H  -6.651783 -0.7820 -1.696068
H  -7.314185 0.767475 -2.355761
H  -6.877262 0.62437 -0.599043
