program: Gaussian 09
title: 000156472
version: EM64L-G09RevD.01
frameworkgroup: C1[X(C17H22N2O4)]
method: RPBEPBE
basis: SDD
operation: Freq
keyword: #p
keyword: freq=noraman
keyword: PBEPBE/SDD
title: #p freq=noraman PBEPBE/SDD
converged: YES YES NO NO
title: Mulliken charges:
elementType: O O O O N N C C C C C C C C C C C C C C C C C H H H H H H H H H H H H H H H H H H H H H H
charge: -0.253659 -0.266448 -0.425856 -0.259508 -0.337391 -0.352462 -0.167525 -0.601598 -0.200189 0.110461 0.150618 0.481312 -0.336505 -0.377383 -0.427451 -0.375329 -0.355869 0.338542 -0.366556 -0.326059 0.400210 -0.779829 -0.788721 0.267254 0.250453 0.242789 0.252159 0.345516 0.327002 0.202760 0.268059 0.240272 0.249805 0.250950 0.251835 0.353619 0.213792 0.214116 0.233234 0.218223 0.223098 0.233734 0.225309 0.227795 0.225423
chargesum: 0.00000
title: Mulliken charges with hydrogens summed into heavy atoms:
elementType: O O O O N N C C C C C C C C C C C C C C C C C
charge: -0.253659 -0.266448 -0.072237 -0.259508 0.008125 -0.025460 0.099729 -0.108357 0.051970 0.110461 0.150618 0.481312 0.134313 -0.137111 -0.177647 -0.124379 -0.104034 0.338542 0.061351 -0.092824 0.400210 -0.104773 -0.110194
polarizability: 3.14882666e+02 3.01964524e+00 1.99540467e+02 4.41561511e+00 -3.07653366e+00 1.42323313e+02
1716.lowfreq: -11.1035 -0.0010 -0.0006 0.0004 3.4406 6.1528 13.6334 21.9710 23.3540
frequency: 12.5128 21.7271 23.2611 30.0479 51.3144 57.4978 70.3660 73.9657 89.3351 107.1711 115.5531 123.1134 150.8182 170.4000 173.1197 206.0446 217.0399 271.4232 281.9877 305.3312 315.5258 344.9679 380.3967 386.1642 393.4187 413.5381 418.6888 432.4431 439.4045 458.1072 464.9730 501.6707 504.7803 541.2373 572.9341 600.7484 609.6350 632.9487 644.6911 701.7671 708.6503 726.7172 749.6159 753.8535 785.0794 806.7164 816.1035 824.3545 831.8953 868.8555 869.1109 915.3162 927.5319 934.8225 947.3622 947.9817 966.2966 978.6135 984.8643 992.9826 1002.0652 1009.8889 1020.1070 1044.6286 1059.8746 1083.5508 1110.8892 1124.6007 1140.4572 1168.7583 1178.6309 1189.6810 1194.3790 1215.5663 1222.3178 1240.8498 1244.6558 1251.4267 1283.1674 1302.4645 1307.0800 1319.4406 1333.2244 1334.8970 1350.8065 1370.6090 1373.6789 1385.6642 1389.5462 1401.1813 1404.1804 1418.0109 1419.9786 1441.7549 1454.1758 1459.7540 1465.0954 1471.6228 1472.3832 1475.4128 1482.2351 1500.1086 1578.9928 1621.7878 1627.5979 1637.1634 1699.7303 2949.9610 2964.1787 2967.9513 2970.7195 3000.3064 3013.1239 3020.2669 3025.7880 3036.9541 3041.3844 3069.5864 3087.4414 3096.5675 3105.4386 3113.2602 3119.4238 3125.2303 3163.3165 3166.1942 3497.1806 3499.0184 3548.0258
redmass: 4.4000 3.7778 4.6811 3.7527 5.6569 4.3660 5.4985 6.3728 4.3274 4.4993 5.5695 1.0493 4.9628 2.5676 2.1166 2.4514 3.8341 3.2660 2.2540 2.5366 3.8631 4.0278 3.6776 1.4168 2.4509 3.0489 3.5854 3.6287 5.4310 4.3510 2.8682 4.0222 3.4600 2.8873 3.2610 2.8324 2.1912 6.4732 2.6897 2.0784 2.3264 3.4997 3.6527 4.3282 2.3328 4.5297 1.6225 3.3606 1.5428 2.3552 2.1399 2.1617 2.6592 5.0958 1.4182 1.4016 1.3589 1.6572 2.7745 1.2612 2.9593 3.3478 2.2110 1.7021 2.8850 1.6957 1.5335 1.5359 2.3831 1.1993 1.3468 1.3176 1.2199 1.9848 3.4492 1.7967 1.3779 1.3916 1.8690 1.4877 1.5314 1.3546 1.2531 1.3404 1.5629 1.4156 1.6655 2.7601 1.3037 1.2300 3.3298 1.5718 3.2834 2.2523 1.0509 1.0749 1.1570 1.0713 1.0603 1.1118 1.1211 2.3772 6.8604 6.4172 5.9964 6.0173 6.3857 1.0604 1.0375 1.0686 1.0388 1.0604 1.0830 1.0845 1.1003 1.0968 1.0962 1.1042 1.0985 1.0960 1.0965 1.0900 1.0897 1.0897 1.0937 1.0948 1.0757 1.0760 1.0659
irintensity: 0.7194 0.1109 0.1574 0.4037 1.1653 0.3694 2.8681 2.0286 0.8422 5.5775 2.0226 0.0672 2.6825 0.6947 1.4889 1.2063 1.7696 2.7217 19.4413 0.5896 2.4724 3.3049 123.7828 169.1721 1.2398 0.2154 3.7246 4.2903 1.3858 0.4151 7.1057 5.0721 4.1045 32.2515 22.1386 1.9244 68.1866 3.9920 21.2325 148.0244 41.0561 13.8086 38.2098 2.6018 10.3941 2.9951 25.0373 7.3360 41.1116 2.1267 21.5112 6.5595 24.8277 172.8083 4.7885 1.7561 0.4849 3.1917 23.2363 7.6713 6.7646 2.0511 41.6306 21.5969 68.3646 5.1583 13.6727 6.2887 3.2977 49.2979 120.0020 3.8753 5.7097 171.6060 119.0430 1.4448 17.5155 29.7757 16.3660 47.3430 43.3300 2.8881 5.9558 7.5963 11.4874 7.5118 6.5187 28.6852 25.4598 25.2357 187.0560 33.3089 3.5569 1.3941 1.5110 4.8781 14.3393 16.7354 20.3067 12.1121 57.8358 133.0592 18.5414 74.2113 204.5289 410.3999 27.9090 30.6485 33.2049 79.7358 44.3702 9.3582 10.6038 25.4152 29.3831 5.2888 40.9861 5.1097 25.3972 33.2735 5.8670 27.0275 11.8355 17.6175 13.2922 5.7978 46.9274 1.6092 4.8720
temp: 298.150 k
press: 1.00000 atm
elementType: 8 8 8 8 7 7 6 6 6 6 6 6 6 6 6 6 6 6 6 6 6 6 6 1 1 1 1 1 1 1 1 1 1 1 1 1 1 1 1 1 1 1 1 1 1
symmnumber: 1
zpe: 960076.1 jmol-1
zpe.correction: 0.365674 hartree
zpe.thermalcorrener: 0.389243 hartree
zpe.thermalcorrenthalpy: 0.390187 hartree
zpe.thermalcorrgfe: 0.308666 hartree
zpe.sumelectzpe: -1069.676329 hartree
zpe.sumelectthermal: -1069.652759 hartree
zpe.sumelectthermalent: -1069.651815 hartree
zpe.sumelectthermalfe: -1069.733337 hartree
dipole: -0.9936 -0.9328 0.7503
dipole: 1.5557
quadrupole: -92.6297 -153.2596 -140.4279
quadrupole: 1.1832 0.6121 -5.5961
quadrupole: 36.1427 -24.4872 -11.6555 1.1832 0.6121 -5.5961
hfenergy: -1070.0420023 hartree
pointgroup: C01 [X(C17H22N2O4)]
dipole: -0.3644136 0.3150541 -0.3775919 debye
polarizability: 314.299535|-9.4487466|196.3615194|0.5966307|-14.7872136|146.0853915 unknown
InChI: InChI=1S/C17H22N2O4/c1-11(2)7-8-23-13-5-3-12(4-6-13)9-14-16(21)19-15(10-20)17(22)18-14/h3-7,14-15,18-20H,8-10H2,1-2H3
charge 0 multiplicity 1
45 atoms
O  4.393758 -2.671715 0.792932
O  3.371238 2.705435 1.206911
O  4.37183 0.710724 -1.846282
O  -3.755222 -0.349706 0.5828
N  2.621105 0.505365 1.292347
N  5.143272 -0.476376 0.715661
C  2.7024 -0.925883 0.948402
C  1.867452 -1.269685 -0.335642
C  4.954857 0.977843 0.575475
C  4.144086 -1.429245 0.810014
C  3.574569 1.463885 1.049981
C  0.385291 -1.004293 -0.131409
C  5.203568 1.444181 -0.891672
C  -0.436926 -1.951753 0.540474
C  -0.213351 0.201676 -0.569063
C  -1.802352 -1.704871 0.764114
C  -1.585687 0.469258 -0.353279
C  -2.385536 -0.489681 0.317996
C  -4.410068 0.916374 0.148847
C  -5.830956 0.874026 0.631243
C  -6.961199 0.921897 -0.131504
C  -8.332144 0.893941 0.523475
C  -6.988983 1.00921 -1.647054
H  2.27398 -1.509206 1.785786
H  2.051196 -2.337042 -0.558189
H  2.26177 -0.662101 -1.170455
H  5.683817 1.509105 1.21711
H  1.698014 0.859008 1.566587
H  6.098729 -0.848367 0.692847
H  6.28163 1.338016 -1.136102
H  4.91068 2.501564 -0.981995
H  -0.002608 -2.90136 0.878206
H  0.397124 0.942573 -1.099978
H  -2.440464 -2.434864 1.271553
H  -2.010609 1.409696 -0.7154
H  4.67905 -0.23157 -1.879666
H  -3.862338 1.764035 0.613279
H  -4.333048 1.008841 -0.951284
H  -5.936527 0.797874 1.722112
H  -8.922518 1.790753 0.249607
H  -8.912411 0.015808 0.177594
H  -8.263287 0.84957 1.623616
H  -7.431433 1.970866 -1.974616
H  -5.994637 0.917983 -2.112772
H  -7.631608 0.208611 -2.06201
