program: Gaussian 09
title: 000156452
version: EM64L-G09RevD.01
frameworkgroup: C1[X(C18H18ClNO2)]
method: RPBEPBE
basis: SDD
operation: Freq
keyword: #p
keyword: freq=noraman
keyword: PBEPBE/SDD
title: #p freq=noraman PBEPBE/SDD
converged: YES YES NO NO
title: Mulliken charges:
elementType: Cl O O N C C C C C C C C C C C C C C C C C C H H H H H H H H H H H H H H H H H H
charge: -0.064667 -0.243326 -0.449976 -0.188083 0.057450 -0.459232 0.349088 0.047647 0.224261 -0.727439 -0.187662 -0.401455 -0.355772 0.406216 -0.648602 -0.260991 -0.220639 -0.391908 -0.414749 -0.213507 -0.203398 -0.105998 0.250761 0.235063 0.230164 0.220356 0.239593 0.206953 0.241868 0.243011 0.236132 0.232440 0.271384 0.226498 0.225200 0.343843 0.267193 0.273570 0.255434 0.253282
chargesum: 0.00000
title: Mulliken charges with hydrogens summed into heavy atoms:
elementType: Cl O O N C C C C C C C C C C C C C C C C C C
charge: -0.064667 -0.243326 -0.106134 -0.188083 0.057450 0.026592 0.349088 0.047647 0.224261 -0.037326 0.019290 -0.159587 -0.112760 0.406216 0.091353 -0.034494 0.004561 -0.124715 -0.141179 0.041927 0.049885 -0.105998
polarizability: 2.75536083e+02 2.70842786e+01 2.10082744e+02 2.61785880e+01 -6.75253713e+00 1.49646845e+02
1716.lowfreq: -9.6391 -7.1157 -0.0017 -0.0017 0.0011 7.3753 9.7134 21.2104 31.6606
frequency: 1.4437 20.8929 31.5858 44.2785 62.5803 98.3884 123.2762 143.1124 166.7040 170.4266 172.5704 185.0480 211.7362 233.4118 244.8115 267.9981 277.2237 302.8402 312.6012 324.8046 335.0780 364.6490 379.2345 411.0983 435.7353 474.1633 475.5508 492.9319 507.1689 535.0846 570.4707 579.9443 622.5187 625.4214 669.4765 687.0898 713.5299 723.4462 754.0828 757.0959 768.4684 814.3641 835.0055 843.1350 859.6851 861.2569 893.3562 935.9480 937.0333 959.9189 975.9922 976.0854 995.6686 1002.1270 1007.0672 1017.4857 1031.7245 1051.1764 1069.7242 1088.2705 1102.0177 1113.2973 1122.6847 1127.1431 1145.8484 1172.6706 1178.5487 1190.5705 1212.0537 1230.1753 1252.3106 1265.9442 1278.4635 1299.0955 1309.0075 1333.1369 1345.6203 1354.2538 1380.7944 1384.6813 1392.1437 1406.4107 1426.8066 1435.7359 1453.3033 1467.3664 1473.4257 1473.8705 1478.9402 1482.1235 1491.0975 1587.4662 1599.1801 1600.9354 1621.3742 1643.3562 2938.5417 2977.6654 2983.2995 3006.6296 3058.8813 3071.6230 3086.2499 3090.2378 3104.7661 3125.3501 3129.3867 3140.8675 3147.8157 3152.1984 3166.8104 3167.8223 3170.8625 3557.9988
redmass: 6.1677 4.8488 5.3535 4.7554 6.4750 5.9196 3.5031 4.8005 3.0887 1.2182 5.1513 3.5780 1.7483 1.4912 2.9725 3.3744 3.7328 2.4433 2.6792 3.1409 2.8040 4.1909 4.3886 2.9059 3.8801 3.9221 6.1616 4.4999 3.4516 5.1485 3.6256 3.6545 6.7026 4.0461 6.2960 6.0082 4.6911 4.1450 2.7800 1.5780 3.5321 2.2562 1.4290 1.8802 2.0524 1.8622 2.7754 1.4854 1.7456 1.3922 1.3255 1.3402 3.3332 3.1315 3.2362 2.4455 2.3199 2.8779 2.6872 3.5338 1.4583 1.6202 1.6126 1.6046 1.7424 1.0982 1.1519 2.0207 1.5913 1.9874 1.6521 1.4702 1.7391 1.4056 1.9994 1.4810 4.1341 1.4890 5.0072 1.2332 2.7405 4.5344 1.2528 1.0884 2.2177 1.1332 1.1031 2.3682 1.0453 1.4753 1.7454 7.4499 6.1809 7.3482 7.7508 9.3093 1.0840 1.0343 1.0341 1.0598 1.1019 1.1026 1.1006 1.1010 1.0991 1.0907 1.0852 1.0898 1.0881 1.0951 1.1004 1.0954 1.0965 1.0660
irintensity: 0.9417 0.8297 0.2507 1.2134 0.8619 2.1352 0.4128 6.7332 0.9206 0.0826 4.7851 0.8515 0.4254 0.6427 0.7377 9.2695 3.0796 55.4461 21.6457 55.7953 26.9841 18.9531 6.3317 2.2691 16.6739 7.1489 4.8629 30.7348 24.5162 9.7465 0.2665 8.2092 1.2756 0.2978 11.0973 5.3940 0.0639 9.4500 8.4179 80.3327 5.2868 34.6014 8.0537 32.4962 2.0117 4.1560 14.4938 3.1320 13.0979 1.1543 0.0890 0.4352 38.1289 6.9963 13.5426 2.9835 69.2042 8.4280 32.1872 14.8446 14.8380 7.1561 31.7367 36.4007 8.0023 1.6218 1.1868 2.7708 17.6499 12.3130 20.1433 36.2645 2.8154 2.0083 39.2380 7.1731 55.3043 9.4746 0.4688 15.1812 7.4916 0.7255 11.0566 16.0007 25.0613 13.6568 2.9079 93.8147 17.2312 112.7412 15.7469 1.1951 7.2095 81.9366 136.6711 134.2443 33.0531 53.5756 22.2540 18.0378 27.4588 4.7466 18.5362 26.9014 1.5030 2.6184 0.8946 10.5470 0.7396 25.4458 21.9545 5.8048 2.1608 10.1125
temp: 298.150 k
press: 1.00000 atm
elementType: 17 8 8 7 6 6 6 6 6 6 6 6 6 6 6 6 6 6 6 6 6 6 1 1 1 1 1 1 1 1 1 1 1 1 1 1 1 1 1 1
symmnumber: 1
zpe: 827468.1 jmol-1
zpe.correction: 0.315166 hartree
zpe.thermalcorrener: 0.335921 hartree
zpe.thermalcorrenthalpy: 0.336865 hartree
zpe.thermalcorrgfe: 0.261375 hartree
zpe.sumelectzpe: -1360.413211 hartree
zpe.sumelectthermal: -1360.392456 hartree
zpe.sumelectthermalent: -1360.391511 hartree
zpe.sumelectthermalfe: -1360.467002 hartree
dipole: -4.0533 -1.1016 -1.9265
dipole: 4.6210
quadrupole: -143.7719 -132.4922 -129.9818
quadrupole: -4.8253 5.6988 -5.4565
quadrupole: -8.3566 2.9231 5.4335 -4.8253 5.6988 -5.4565
hfenergy: -1360.7283767 hartree
pointgroup: C01 [X(C18H18Cl1N1O2)]
dipole: 1.5445616 0.733062 -0.6182652 debye
polarizability: 269.7361941|37.8420618|210.7950348|-19.3206555|17.7832732|154.7344436 unknown
InChI: InChI=1S/C18H18ClNO2/c1-18(11-16(21)12-7-9-13(19)10-8-12)14-5-3-4-6-15(14)20(2)17(18)22/h3-10,16,21H,11H2,1-2H3
charge 0 multiplicity 1
40 atoms
Cl -6.790698 -0.849858 -0.45592
O  0.737803 -2.71981 0.111955
O  -0.542618 1.984778 0.014304
N  2.403721 -1.322909 -0.823975
C  1.321219 -0.490222 1.147482
C  -0.163444 -0.041202 1.272201
C  2.295834 0.532258 0.570095
C  1.418706 -1.65584 0.118842
C  2.931179 -0.024946 -0.572589
C  1.806117 -1.020105 2.529697
C  -0.790078 0.531021 -0.020883
C  2.650764 1.817814 1.000257
C  3.919413 0.66591 -1.297051
C  -2.282999 0.209542 -0.132186
C  2.800109 -2.197488 -1.925331
C  3.645302 2.536556 0.285009
C  4.270967 1.964021 -0.847224
C  -2.689985 -1.081957 -0.554962
C  -3.269025 1.16884 0.19899
C  -4.058637 -1.413007 -0.653702
C  -4.64488 0.854554 0.104542
C  -5.016139 -0.433394 -0.3232
H  -0.739394 -0.926419 1.596479
H  -0.259121 0.731323 2.057976
H  2.856435 -1.357098 2.483123
H  1.735166 -0.219445 3.287549
H  1.177892 -1.870818 2.848796
H  -0.275916 0.088162 -0.902588
H  2.155121 2.274053 1.863514
H  4.404788 0.226243 -2.174545
H  3.870713 -2.464009 -1.853935
H  2.617225 -1.714107 -2.902931
H  2.193571 -3.11524 -1.856636
H  3.926816 3.544224 0.608664
H  5.03759 2.530197 -1.388114
H  -0.763483 2.373953 -0.869985
H  -1.935706 -1.841783 -0.795638
H  -2.955279 2.161983 0.536465
H  -4.373129 -2.408415 -0.98014
H  -5.408619 1.595039 0.360096
