program: Gaussian 09
title: 000156445
version: EM64L-G09RevD.01
frameworkgroup: C1[X(C7H10N4OS)]
method: RPBEPBE
basis: SDD
operation: Freq
keyword: #p
keyword: freq=noraman
keyword: PBEPBE/SDD
title: #p freq=noraman PBEPBE/SDD
converged: YES YES NO NO
title: Mulliken charges:
elementType: S O N N N N C C C C C C C H H H H H H H H H H
charge: 0.309456 -0.252915 0.037855 -0.035956 -0.370047 -0.505720 -0.333032 0.127420 -0.582380 0.152843 -0.668710 -0.269531 -0.301523 0.272340 0.271935 0.230296 0.230386 0.223832 0.248365 0.246222 0.358687 0.303673 0.306503
chargesum: 0.00000
title: Mulliken charges with hydrogens summed into heavy atoms:
elementType: S O N N N N C C C C C C C
charge: 0.309456 -0.252915 0.037855 -0.035956 -0.011359 0.104456 -0.333032 0.127420 -0.038105 0.152843 0.015804 -0.023309 -0.053158
polarizability: 1.80855686e+02 -8.58103331e+00 1.55792987e+02 -5.80516126e-01 1.30609071e-01 6.16597132e+01
1716.lowfreq: -19.8765 -8.9708 -6.1624 0.0001 0.0015 0.0023 26.0473 37.9555 54.9986
frequency: 21.8493 37.8576 54.7035 85.6219 98.4070 106.9021 156.2475 157.6916 232.9131 236.2554 254.5940 282.2749 308.9678 361.7820 457.0763 467.4648 488.4321 500.6958 608.6270 622.6552 689.9206 709.9365 760.6796 771.3602 772.5285 798.8659 853.0890 875.3745 944.8712 991.2106 1010.7693 1031.6234 1041.5239 1062.1992 1105.1946 1164.1991 1214.2693 1226.7357 1246.5893 1263.0055 1281.5257 1284.0526 1349.0281 1395.5879 1397.4203 1439.3635 1460.3822 1471.4751 1481.6844 1485.2241 1500.4682 1594.2308 1675.1185 2985.7837 3047.4396 3080.5360 3082.7541 3127.4209 3139.0887 3169.8417 3388.1295 3505.1242 3525.4616
redmass: 3.2374 1.4300 3.2320 5.2413 4.2377 3.1917 3.5344 3.0199 1.1598 5.7764 4.7452 4.2027 5.5882 6.7639 7.0119 9.4357 5.1918 8.6692 4.8689 9.9818 2.2831 1.5805 4.8214 1.8394 1.1248 7.4989 1.2741 8.8227 1.4754 1.7115 6.0292 1.2055 3.8938 2.4011 3.4301 3.3822 2.7042 1.2436 3.3522 1.3835 1.9134 1.3681 2.6657 1.2057 1.8639 1.0856 2.1260 1.0393 1.0558 4.4342 6.9117 10.1666 1.0625 1.0354 1.0596 1.0972 1.1009 1.1078 1.0889 1.0983 1.0428 1.0987 1.0792
irintensity: 0.6682 40.5398 0.7483 0.6848 2.0294 0.0283 6.8732 9.7766 0.1050 11.2892 0.5736 0.4122 31.0300 3.4052 11.8791 11.7832 0.1503 6.0813 2.3594 0.6517 93.6439 61.8115 4.3412 162.9663 12.2898 0.8709 29.6245 22.7590 0.0020 16.4889 11.3082 0.2242 30.4640 1.9671 62.1878 36.3781 1.7728 0.6266 22.8032 43.2767 6.1203 0.8071 64.6649 15.7905 14.1348 11.4959 248.2213 15.3136 12.5224 29.8693 29.9770 180.3985 33.0638 36.7656 6.3634 26.9872 14.5116 25.0605 6.3199 33.1330 0.2409 1.8882 56.0320
temp: 298.150 k
press: 1.00000 atm
elementType: 16 8 7 7 7 7 6 6 6 6 6 6 6 1 1 1 1 1 1 1 1 1 1
symmnumber: 1
zpe: 454234.7 jmol-1
zpe.correction: 0.173009 hartree
zpe.thermalcorrener: 0.186963 hartree
zpe.thermalcorrenthalpy: 0.187908 hartree
zpe.thermalcorrgfe: 0.129991 hartree
zpe.sumelectzpe: -964.029528 hartree
zpe.sumelectthermal: -964.015574 hartree
zpe.sumelectthermalent: -964.014630 hartree
zpe.sumelectthermalfe: -964.072546 hartree
dipole: 0.9577 2.7559 0.2021
dipole: 2.9246
quadrupole: -78.3818 -76.4313 -83.2158
quadrupole: 0.4478 -1.0472 -0.3021
quadrupole: 0.9612 2.9117 -3.8728 0.4478 -1.0472 -0.3021
hfenergy: -964.2025371 hartree
pointgroup: C01 [X(C7H10N4O1S1)]
dipole: -0.4631564 -1.0470092 0.1147189 debye
dipolederiv: -0.0594613 0.405887 -0.0078662 0.6833638 -0.3559031 -0.0161664 -0.0144188 -0.0070456 -0.0364551 -0.8485575 -0.0847958 0.012285 0.2184966 -0.725055 0.0124624 0.0036242 0.0143024 -0.3290263 -0.1721728 -0.1580673 0.0029054 0.5349254 -0.6856583 -0.0073944 -0.0108499 0.0179914 -0.1922274 -0.3743737 0.0309098 0.0051645 0.0518367 0.1502405 -0.0100302 -0.006972 -0.0138902 -0.2088811 -0.9560625 0.0233038 -0.0196985 0.2909279 -0.110186 -0.003963 -0.0171534 0.0182498 -0.4273247 -0.4730932 0.0701364 0.0520314 0.1790893 -0.1403167 -0.0174079 0.037563 -0.0062478 -0.0438006 0.2471289 -0.6782022 0.0062344 -0.9575895 0.8751592 0.0134737 0.0218323 0.0079031 0.0202669 -0.2132729 0.4939916 0.0027285 -0.0847181 -0.340527 0.0128985 -0.0114685 -0.0134088 0.1045278 0.4527064 -0.1248293 -0.0090208 -0.060401 0.0212666 0.0041003 -0.0105014 0.0055256 0.1294416 1.5239001 0.0063403 -0.0132446 -0.2023688 0.7611784 -0.017871 -0.0291075 -0.0228537 0.1791931 -0.1378152 0.147036 0.0038797 -0.0595189 0.0443559 0.0028152 0.0091373 -0.0046941 0.0663911 0.3829652 0.3692732 -0.0196832 -0.2063886 0.2613965 0.0004825 -0.0076825 -0.0176196 0.0039085 -0.216605 -0.511587 0.013618 -0.048758 -0.0474257 0.0018371 0.0130487 0.0200703 -0.0617738 -0.0636152 0.0291027 -0.0149066 -0.0517912 -0.0085556 -0.0896197 -0.0126089 -0.0844291 -0.0237138 -0.0621271 0.0366452 0.0156281 -0.0441242 -0.0007426 0.0921202 0.0174655 0.0813238 -0.0349568 0.1244872 -0.061355 -0.0588925 0.0246162 0.0017885 -0.1007723 -0.0142446 -0.11827 -0.0549896 0.1290667 -0.0501336 0.0478338 0.0319521 0.0124022 0.0953009 -0.0009936 0.1188679 -0.0699313 -0.2042035 0.0020186 0.0118376 -0.0190413 0.050872 0.0024081 0.0124353 0.0016047 0.1213519 0.0602357 0.0905141 0.0013484 0.0414767 -0.0770969 0.0026759 0.0034664 0.0012665 0.1507845 0.0484537 -0.1124587 0.0051297 -0.0481009 -0.0731055 0.0056196 0.0006664 0.0066239 0.1310962 0.2852727 -0.002919 0.0037636 -0.0129995 0.2058849 0.0028195 0.0505558 0.0090791 0.3403044 0.3159642 0.0304412 0.0992173 -0.1686521 0.086371 -0.0829867 0.0727991 -0.0510638 0.0802552 0.2111793 0.048748 -0.1402929 -0.0922325 0.0936567 0.0971977 -0.106593 0.036714 0.1555593 unknown
polarizability: 179.1746945|-10.6039782|157.3623163|-2.926204|-1.7239329|61.7713751 unknown
InChI: InChI=1S/C7H10N4OS/c1-2-13-7-5(6(12)11-8)9-3-4-10-7/h3-4,11H,2,8H2,1H3
charge 0 multiplicity 1
23 atoms
S  -1.531304 1.29606 -0.118062
O  1.2257 1.994335 -0.233703
N  -1.438769 -1.435898 -0.06294
N  1.37614 -1.621131 -0.153525
N  3.011676 0.488834 -0.218127
N  4.025729 1.477564 -0.302598
C  -0.674099 -0.298154 -0.113235
C  0.760501 -0.401269 -0.156587
C  -3.343626 0.692179 -0.036936
C  1.66542 0.800375 -0.203601
C  -4.244229 1.935208 -0.033924
C  -0.805238 -2.638079 -0.060089
C  0.604659 -2.740667 -0.106589
H  -3.518402 0.042698 -0.908194
H  -3.452944 0.08607 0.875406
H  -4.042991 2.582329 0.838367
H  -4.10841 2.538608 -0.949103
H  -5.304009 1.62386 0.012482
H  1.117276 -3.706444 -0.106606
H  -1.442661 -3.527658 -0.020739
H  3.296822 -0.494081 -0.226279
H  4.074794 2.020589 0.571794
H  3.844467 2.103873 -1.100413
