program: Gaussian 09
title: 000156444
version: EM64L-G09RevD.01
frameworkgroup: C1[X(C23H20F2N2O3)]
method: RPBEPBE
basis: SDD
operation: Freq
keyword: #p
keyword: freq=noraman
keyword: PBEPBE/SDD
title: #p freq=noraman PBEPBE/SDD
converged: YES YES NO NO
title: Mulliken charges:
elementType: F F O O O N N C C C C C C C C C C C C C C C C C C C C C C C H H H H H H H H H H H H H H H H H H H H
charge: -0.218626 -0.157255 -0.263004 -0.211915 -0.164864 -0.482629 -0.494351 -0.412289 -0.552871 -0.292710 0.501151 -0.412589 -0.405758 0.351045 -0.226569 -0.228254 -0.361525 -0.341558 0.491719 -0.242342 -0.434918 -0.340272 0.277034 -0.090950 0.212550 0.284037 0.255192 -0.376587 -0.382023 -0.146883 0.230878 0.230292 0.203316 0.205191 0.206781 0.205250 0.231460 0.230969 0.224279 0.224045 0.252663 0.249949 0.220294 0.302913 0.227888 0.305714 0.333906 0.266102 0.268245 0.247878
chargesum: 0.00000
title: Mulliken charges with hydrogens summed into heavy atoms:
elementType: F F O O O N N C C C C C C C C C C C C C C C C C C C C C C C
charge: -0.218626 -0.157255 -0.263004 -0.211915 -0.164864 -0.176915 -0.160445 0.048881 -0.144364 0.119321 0.501151 -0.181129 -0.174789 0.351045 -0.002290 -0.004209 -0.108862 -0.091609 0.491719 -0.014453 -0.214624 -0.037359 0.277034 -0.090950 0.212550 0.284037 0.255192 -0.110485 -0.113778 0.100995
polarizability: 4.88949284e+02 1.83822549e+01 2.35086192e+02 -1.40558176e+01 4.94055804e+00 1.67069706e+02
1716.lowfreq: -7.1108 -3.4250 -0.0019 0.0010 0.0016 1.4616 2.7123 9.9535 16.1666
frequency: -5.8967 9.8952 16.1385 17.7166 22.3469 35.4206 48.7699 52.6254 65.7659 68.9677 76.8626 106.3000 134.5486 140.4378 144.8556 152.8806 194.3007 203.6224 219.9919 229.5288 254.9484 260.3799 298.9975 332.5093 335.8864 344.7226 366.3461 379.3913 393.5906 402.2617 413.6868 454.0494 474.7523 495.4857 504.0005 513.4555 522.4462 549.0127 566.4152 570.8761 578.2062 586.5710 607.6086 617.6272 629.1435 655.8773 669.0407 703.2066 705.1792 719.8793 746.5990 756.6387 760.0543 771.1006 784.1903 801.3921 812.4388 814.1713 832.9632 836.2557 852.7802 871.8971 881.1796 889.2074 917.5396 933.0048 940.5155 965.7025 967.3899 970.4670 975.5293 980.3347 990.1606 994.2911 1000.2533 1025.2988 1033.6672 1042.9882 1051.5161 1085.7334 1101.1486 1101.7621 1124.3034 1157.6214 1162.1942 1167.0290 1172.0958 1183.5276 1186.7685 1200.7287 1217.3596 1218.2274 1230.2629 1231.7838 1262.4399 1263.0205 1264.9020 1281.5790 1310.2498 1327.3816 1337.8430 1369.2288 1375.2350 1382.7248 1384.8910 1421.7935 1433.7585 1440.7386 1447.3979 1450.6817 1470.9464 1477.8793 1483.8998 1490.0528 1500.1712 1510.0502 1574.4730 1593.7316 1594.9448 1614.8226 1619.1089 1629.6451 1634.9900 1677.1588 2941.6731 2975.0442 2998.7820 3006.7646 3025.3459 3073.2745 3113.4607 3113.9241 3114.5269 3131.4290 3143.2227 3159.4755 3162.0815 3162.1891 3168.8324 3182.4917 3192.9097 3194.5811 3514.5029 3523.8242
redmass: 4.3519 5.3508 4.7825 7.3975 6.7055 7.0452 4.0969 6.5343 5.9791 7.0082 5.6871 3.2203 4.6023 6.3441 2.2905 9.1375 6.3579 7.1874 6.6370 4.7902 7.4987 7.8141 8.0710 2.3953 7.4955 5.4845 5.6041 6.8207 6.5238 2.8190 3.1073 5.1866 5.0689 6.6869 3.6192 6.6688 2.4067 5.4180 3.9291 1.7577 3.2987 4.0659 1.2489 6.3580 6.7595 5.3733 6.5496 6.4006 1.7552 3.7283 5.6153 2.3609 2.2105 1.1093 4.4001 2.5683 3.0107 1.4898 2.1525 3.1681 1.2469 1.2488 1.3994 7.3410 1.4451 7.7621 1.3634 2.1587 2.3363 1.3422 1.3872 8.1809 6.3331 1.3141 2.7119 2.3773 3.4428 1.5474 2.5127 3.1612 1.4322 2.6028 1.3166 2.3713 1.2022 1.1877 1.0520 1.2608 1.1164 2.6363 2.4054 2.5134 6.2204 2.5381 1.8246 1.2712 1.5453 1.0974 1.4329 1.2541 1.4297 4.1568 10.4953 7.7145 1.5518 3.9377 2.7655 2.1728 2.8452 2.0307 1.1077 1.1390 2.2079 1.1762 1.8529 2.4170 7.1494 6.0508 5.4306 6.1961 8.3993 6.4578 5.2404 7.6827 1.0549 1.0591 1.1063 1.0595 1.1018 1.1051 1.0900 1.0875 1.0868 1.0906 1.0958 1.0898 1.0882 1.1015 1.0946 1.0931 1.0998 1.0948 1.0775 1.0765
irintensity: 0.4210 0.1119 0.1032 0.2940 2.3517 0.6659 0.4728 9.4467 3.5037 0.3928 1.2206 4.7702 2.3240 2.6333 1.8810 0.0510 1.3027 0.2936 2.7046 0.0128 0.5280 0.8766 1.1686 0.1834 6.1533 0.9366 2.6936 1.3431 3.5249 0.0003 0.1081 2.1944 2.8377 4.3559 15.0518 38.7285 30.9031 8.8901 4.3396 59.9249 9.5739 12.7030 139.9993 0.0847 2.2486 8.3285 2.2904 47.7247 52.7728 1.2081 15.1020 14.7739 37.3419 4.7851 25.1237 69.4648 6.6972 17.0778 43.3833 54.3483 0.2743 1.6375 0.4751 26.9569 2.9918 41.7816 0.5367 37.7419 49.5493 6.4545 0.0149 85.2296 0.8151 0.2776 24.2512 9.6087 2.9052 3.8454 7.5782 15.1011 5.8990 33.3517 15.5905 558.5543 2.6319 96.6914 0.1924 37.0148 0.1900 16.3652 37.6593 483.6936 42.9979 12.5495 9.4798 0.3380 30.1410 0.7448 13.8375 0.1235 1.2311 84.0230 2.4693 0.0987 15.7113 34.8211 96.0208 6.8721 104.5332 1068.0446 2.3610 6.6937 24.8211 23.3001 34.9974 368.9770 35.3901 1.4336 7.0293 13.8595 96.7079 38.1307 67.1011 326.1405 34.6114 31.0561 30.0104 25.6221 7.7556 40.4101 22.5657 8.4778 10.7799 10.2849 45.2832 14.9571 4.6766 25.7142 5.5696 0.8123 2.3931 7.0282 21.7032 27.5660
temp: 298.150 k
press: 1.00000 atm
elementType: 9 9 8 8 8 7 7 6 6 6 6 6 6 6 6 6 6 6 6 6 6 6 6 6 6 6 6 6 6 6 1 1 1 1 1 1 1 1 1 1 1 1 1 1 1 1 1 1 1 1
symmnumber: 1
zpe: 999543.8 jmol-1
zpe.correction: 0.380706 hartree
zpe.thermalcorrener: 0.407111 hartree
zpe.thermalcorrenthalpy: 0.408055 hartree
zpe.thermalcorrgfe: 0.318614 hartree
zpe.sumelectzpe: -1421.187974 hartree
zpe.sumelectthermal: -1421.161569 hartree
zpe.sumelectthermalent: -1421.160625 hartree
zpe.sumelectthermalfe: -1421.250066 hartree
dipole: -1.5416 5.6134 2.0925
dipole: 6.1859
quadrupole: -111.9223 -179.9687 -172.6343
quadrupole: -36.1893 -14.1625 -1.8371
quadrupole: 42.9195 -25.1270 -17.7925 -36.1893 -14.1625 -1.8371
hfenergy: -1421.5686804 hartree
pointgroup: C01 [X(C23H20F2N2O3)]
dipole: -0.5870334 -1.904534 -1.3968091 debye
polarizability: 489.0080882|-20.4151044|227.2784215|10.7516258|21.8890844|174.8186723 unknown
InChI: InChI=1S/C23H20F2N2O3/c24-19-9-4-10-20(25)21(19)22(28)27-23(29)26-17-11-13-18(14-12-17)30-15-5-8-16-6-2-1-3-7-16/h1-4,6-7,9-14,26-27H,5,8,15H2
charge 0 multiplicity 1
50 atoms
F  -5.973747 -2.171487 -0.319338
F  -7.68859 2.342644 0.229032
O  3.592372 -0.900713 0.024256
O  -2.603529 1.592694 0.55321
O  -5.400261 1.430399 1.549346
N  -2.065839 -0.669842 0.152326
N  -4.296724 -0.001629 0.046709
C  5.885022 -0.14123 0.075031
C  6.861486 1.058344 0.22729
C  4.425645 0.303362 0.191855
C  8.316988 0.634029 0.089936
C  9.079037 0.266217 1.22854
C  8.932297 0.560768 -1.186603
C  2.198523 -0.740822 0.076315
C  10.418569 -0.165558 1.097277
C  10.271087 0.130017 -1.323713
C  1.44089 -1.925684 -0.100396
C  1.530517 0.489625 0.289364
C  -0.637953 -0.639848 0.140716
C  11.019589 -0.235779 -0.18079
C  0.038717 -1.873077 -0.07023
C  0.119957 0.542551 0.326301
C  -2.936547 0.412149 0.292943
C  -6.754105 0.110277 0.028462
C  -5.436468 0.588557 0.621708
C  -7.030646 -1.220316 -0.367035
C  -7.860636 0.994578 -0.083006
C  -8.277195 -1.683869 -0.807703
C  -9.133481 0.593541 -0.524598
C  -9.339931 -0.756314 -0.880696
H  6.09957 -0.901294 0.84892
H  6.039211 -0.628691 -0.905507
H  6.616453 1.81944 -0.540215
H  6.697964 1.533741 1.214672
H  4.225798 0.760449 1.184296
H  4.172284 1.044723 -0.595725
H  8.621288 0.323497 2.224368
H  8.35989 0.848923 -2.077661
H  10.993036 -0.442137 1.988814
H  10.731052 0.08389 -2.317524
H  1.968779 -2.870101 -0.261618
H  2.090012 1.417952 0.435425
H  -0.535208 -2.797765 -0.21448
H  -0.394393 1.488389 0.504921
H  12.058878 -0.567228 -0.28453
H  -2.484867 -1.602086 0.111281
H  -4.45018 -0.782017 -0.597578
H  -8.401764 -2.734465 -1.081245
H  -9.933713 1.335343 -0.587107
H  -10.326132 -1.085447 -1.220316
