program: Gaussian 09
title: 000156441
version: EM64L-G09RevD.01
frameworkgroup: C1[X(C11H16N4O)]
method: RPBEPBE
basis: SDD
operation: Freq
keyword: #p
keyword: freq=noraman
keyword: PBEPBE/SDD
title: #p freq=noraman PBEPBE/SDD
converged: YES YES NO NO
title: Mulliken charges:
elementType: O N N N N C C C C C C C C C C C H H H H H H H H H H H H H H H H
charge: -0.302568 -0.182767 -0.107275 -0.102193 -0.030787 -0.413981 -0.377498 -0.343371 0.286208 0.215067 -0.317327 -0.313946 -0.622083 -0.608085 -0.202401 -0.212030 0.242047 0.216025 0.247752 0.237413 0.203011 0.207291 0.248330 0.276733 0.228499 0.196035 0.224474 0.222334 0.193223 0.226761 0.229754 0.235355
chargesum: 0.00000
title: Mulliken charges with hydrogens summed into heavy atoms:
elementType: O N N N N C C C C C C C C C C C
charge: -0.302568 -0.182767 -0.107275 -0.102193 -0.030787 0.044091 0.107668 0.066931 0.286208 0.215067 -0.068997 -0.037213 0.026924 0.034234 0.027354 0.023324
polarizability: 1.97657850e+02 1.03235044e+00 1.75149083e+02 1.47585342e+01 -2.09890742e+00 8.96000914e+01
1716.lowfreq: -6.1955 -3.6568 -0.0007 -0.0007 -0.0002 5.5116 14.8689 21.4975 38.9954
frequency: 14.8181 21.4751 38.9717 62.1907 99.0086 162.3438 204.8982 207.9630 224.9002 234.9015 255.9790 267.8905 296.4090 301.0017 366.0475 382.9314 416.0261 422.3196 487.3631 528.6623 548.5785 581.9208 600.0699 603.9083 675.6506 717.5675 734.3622 755.7013 756.8452 796.7888 813.6770 851.7986 876.8079 951.0492 956.5309 982.4330 992.3909 999.9087 1032.5575 1036.7824 1058.5622 1074.9687 1078.8184 1083.3091 1095.5725 1137.7813 1142.0860 1156.2963 1187.0297 1194.4899 1233.3817 1261.5516 1271.0206 1286.6267 1294.5349 1315.8738 1355.8619 1360.0038 1366.6617 1399.4186 1418.4361 1424.4988 1440.9999 1453.0086 1461.2814 1462.6672 1470.1589 1475.6013 1477.3945 1485.6038 1486.9836 1488.9601 1603.6979 1617.2236 2855.8482 2858.2274 2874.5473 3000.7967 3013.1779 3020.2052 3022.0953 3027.8984 3057.4897 3079.2898 3083.6344 3089.1891 3139.2095 3156.7256 3169.2562 3184.4909
redmass: 4.4287 3.2609 3.1380 3.6944 3.5462 4.8789 4.0871 1.7488 1.4021 1.7655 1.7320 3.8139 3.8334 2.9162 1.9549 5.3070 2.2777 2.9527 3.5076 5.3606 5.5173 6.8937 5.7516 6.0544 4.9058 5.9480 1.9537 4.7909 1.3338 3.4002 2.1825 1.3399 1.9353 1.3543 2.3798 1.3006 4.1005 2.1147 1.7102 3.1030 2.3154 3.0089 2.1961 1.6054 1.7972 1.4836 1.8906 1.4644 1.7480 2.0805 1.6229 2.1603 1.6697 1.3645 1.4269 1.2855 2.6786 2.0037 1.3396 2.8512 1.1416 7.0835 1.1638 2.8765 1.0755 1.0721 1.1264 1.1078 1.0563 1.1334 1.0613 2.8236 7.7198 7.9531 1.0670 1.0571 1.0587 1.0667 1.0799 1.0632 1.0729 1.0731 1.1004 1.1013 1.1009 1.1050 1.0864 1.0904 1.0967 1.0985
irintensity: 1.3217 1.8364 0.8247 0.0177 0.2618 1.4505 0.1500 0.5981 0.4685 0.8564 1.2099 1.4335 5.7153 4.1358 5.4378 2.7078 0.3002 5.8621 6.8464 4.7851 2.3539 2.4745 3.5026 4.5368 16.3457 2.0394 14.1488 12.2425 98.6086 3.5610 2.2759 0.1739 7.0588 1.9736 33.7049 0.1893 1.5422 12.2413 14.2082 8.5999 4.1707 17.1503 19.4554 1.1187 12.9206 5.2286 8.2980 8.5676 1.1622 4.6733 54.0528 8.7085 9.6708 0.0842 20.4187 3.7317 92.0040 101.6236 0.8855 64.7014 2.5277 1.3160 3.8004 32.6404 4.2141 7.0402 7.3056 21.4544 21.5021 8.6482 13.3898 62.0294 6.4808 22.8642 46.9161 63.6992 273.4047 6.0174 13.9189 26.0834 54.4141 36.9284 14.9985 19.7359 51.7878 27.6633 4.2361 11.5351 9.5492 8.8024
temp: 298.150 k
press: 1.00000 atm
elementType: 8 7 7 7 7 6 6 6 6 6 6 6 6 6 6 6 1 1 1 1 1 1 1 1 1 1 1 1 1 1 1 1
symmnumber: 1
zpe: 687935.7 jmol-1
zpe.correction: 0.262021 hartree
zpe.thermalcorrener: 0.277444 hartree
zpe.thermalcorrenthalpy: 0.278388 hartree
zpe.thermalcorrgfe: 0.216867 hartree
zpe.sumelectzpe: -721.691233 hartree
zpe.sumelectthermal: -721.675810 hartree
zpe.sumelectthermalent: -721.674866 hartree
zpe.sumelectthermalfe: -721.736387 hartree
dipole: -5.2995 5.0085 -0.0567
dipole: 7.2919
quadrupole: -92.2478 -100.8226 -96.9596
quadrupole: 17.4149 -0.1812 1.4483
quadrupole: 4.4289 -4.1459 -0.2829 17.4149 -0.1812 1.4483
hfenergy: -721.9532541 hartree
pointgroup: C01 [X(C11H16N4O1)]
dipole: -2.0387642 2.008347 -0.2010503 debye
polarizability: 197.8957794|1.8235427|173.862392|13.8306495|-10.5656156|90.6488526 unknown
InChI: InChI=1S/C11H16N4O/c1-13(2)8-5-9-14-10-6-3-4-7-11(10)15(16)12-14/h3-4,6-7H,5,8-9H2,1-2H3
charge 0 multiplicity 1
32 atoms
O  3.250105 -2.381248 0.526931
N  0.277892 -0.78085 -0.307437
N  -3.88041 0.415845 -0.063995
N  2.279942 -1.560213 0.22076
N  0.970347 -1.971538 0.004079
C  -1.968806 -0.98742 0.800558
C  -1.171668 -0.85796 -0.516727
C  -3.485947 -0.885369 0.536216
C  1.103612 0.331527 -0.271156
C  2.399483 -0.151227 0.060347
C  0.88506 1.71529 -0.495104
C  3.522928 0.687551 0.180542
C  -3.812793 1.536958 0.898343
C  -5.203719 0.348528 -0.721435
C  2.00463 2.559036 -0.374677
C  3.305651 2.060222 -0.042751
H  -1.74492 -1.960592 1.275362
H  -1.641549 -0.203923 1.509756
H  -1.497176 0.052185 -1.049449
H  -1.374485 -1.724306 -1.171368
H  -4.037594 -1.08536 1.490048
H  -3.779734 -1.683499 -0.173482
H  -0.101765 2.112395 -0.750691
H  4.502346 0.273748 0.434493
H  -2.7928 1.636773 1.307483
H  -4.517898 1.414145 1.759252
H  -4.062762 2.481222 0.382749
H  -5.420309 1.311298 -1.218102
H  -6.041476 0.133145 -0.011127
H  -5.198046 -0.440777 -1.49385
H  1.87875 3.634624 -0.540601
H  4.141512 2.76239 0.037035
