program: Gaussian 09
title: 000014089
version: EM64L-G09RevD.01
frameworkgroup: C1[X(C8H8Cl2)]
method: RPBEPBE
basis: SDD
operation: Freq
keyword: #pfreq=noraman
keyword: PBEPBE/SDD
title: #p freq=noraman PBEPBE/SDD
converged: YES YES NO NO
title: Mulliken charges:
elementType: Cl Cl C C C C C C C C H H H H H H H H
charge: -0.074908 -0.053752 -0.549114 0.634944 -0.413053 -0.343015 -0.555108 -0.215643 -0.226132 -0.233388 0.299013 0.234371 0.230022 0.291427 0.277605 0.232413 0.230425 0.233891
chargesum: 0.00000
title: Mulliken charges with hydrogens summed into heavy atoms:
elementType: Cl Cl C C C C C C C C
charge: -0.074908 -0.053752 -0.250101 0.634944 -0.178681 -0.112993 0.013924 0.016770 0.004293 0.000503
polarizability: 1.21556827e+02 1.47670931e+01 9.20688941e+01 6.95085156e-01 3.99744361e+00 9.05985497e+01
1716.lowfreq: -9.4297 -1.7425 -0.0010 0.0019 0.0029 7.7228 19.6556 60.4080 119.0066
frequency: 18.8495 60.3830 119.0055 156.4541 202.8457 235.5033 291.1140 399.9756 413.1807 497.8242 551.0221 612.5222 627.4492 668.5544 697.0831 762.3809 783.2902 846.9810 925.5174 939.6978 976.7458 990.7709 999.4438 1023.9000 1062.4091 1083.6917 1140.4719 1172.3721 1176.1857 1191.0089 1219.2202 1264.7910 1312.0197 1360.6006 1393.1520 1445.3396 1455.4005 1485.9792 1595.1358 1613.0198 3080.6678 3097.2470 3125.0682 3129.1531 3140.6225 3152.7822 3167.4852 3168.3848
redmass: 4.2763 8.5553 5.7929 7.3600 3.0617 6.2448 10.3574 2.7709 4.1349 3.7752 3.7222 6.1474 6.3208 5.4191 1.6155 3.6004 2.0090 1.2579 1.4315 1.6438 1.4043 5.9737 1.3315 2.4056 2.6039 1.4774 1.2669 1.1249 1.0677 1.1106 1.9646 1.1905 1.5030 1.6700 4.5333 1.9234 1.1645 2.3458 5.9817 6.0989 1.0576 1.0872 1.0864 1.0870 1.0916 1.0964 1.1113 1.1018
irintensity: 0.0804 1.1064 5.1972 6.4043 0.3346 0.7606 6.6510 0.3432 7.0277 20.8814 12.4844 21.2978 111.3551 9.7676 65.6539 3.4614 22.4441 0.2714 1.1717 11.3362 0.0993 0.8791 0.0194 2.2443 1.6100 6.3587 8.7352 3.6611 1.0270 1.0424 23.7335 11.5119 11.8932 9.1551 2.0772 5.9328 22.4253 1.7720 0.4833 2.4514 7.2956 4.2851 4.7553 1.2395 13.0285 33.8576 5.5673 19.4057
temp: 298.150 k
press: 1.00000 atm
elementType: 17 17 6 6 6 6 6 6 6 6 1 1 1 1 1 1 1 1
symmnumber: 1
zpe: 357879.0 jmol-1
zpe.correction: 0.136309 hartree
zpe.thermalcorrener: 0.145936 hartree
zpe.thermalcorrenthalpy: 0.146880 hartree
zpe.thermalcorrgfe: 0.098840 hartree
zpe.sumelectzpe: -1229.043517 hartree
zpe.sumelectthermal: -1229.033890 hartree
zpe.sumelectthermalent: -1229.032945 hartree
zpe.sumelectthermalfe: -1229.080985 hartree
dipole: -1.4099 -0.2230 0.1085
dipole: 1.4316
quadrupole: -65.5944 -84.9420 -65.1530
quadrupole: 2.6738 0.5359 -0.0172
quadrupole: 6.3021 -13.0456 6.7435 2.6738 0.5359 -0.0172
hfenergy: -1229.1798256 hartree
pointgroup: C01 [X(C8H8Cl2)]
dipole: -0.5557072 0.0900486 -0.0174552 debye
dipolederiv: -0.4927149 0.0946796 0.0440224 0.2918992 -0.6194958 -0.2663713 0.2825992 -0.3155677 -0.3526466 -0.2187878 -0.0514318 -0.0221052 -0.1013222 -0.4927488 -0.2223454 -0.0511486 -0.2421656 -0.3339858 0.8431666 -0.1716728 -0.0241955 -0.3740526 0.6201045 0.300435 -0.2139117 0.3022243 0.3710295 -0.2451857 0.0395064 -0.0097967 -0.0394813 -0.0827277 -0.0308941 -0.0669742 -0.0156623 -0.0636419 -0.0195072 -0.073356 0.0686674 0.0382415 -0.0803421 -0.1072971 -0.0191685 -0.0810142 0.0151027 0.0018336 0.0295304 -0.0875264 -0.0525231 -0.0644621 -0.03588 -0.0379064 -0.06573 -0.0294273 0.0679825 0.0459447 0.0444805 0.1142921 0.4950448 0.3161885 0.1079137 0.2651636 0.3694301 -0.023195 0.0540965 -0.1277099 0.0492568 -0.1104241 -0.0533307 -0.1458047 -0.0478905 0.0084806 -0.1134413 -0.0447658 0.0816631 -0.0663632 -0.0577035 -0.1144313 0.0964397 -0.1249756 0.033146 0.1028333 -0.0471667 0.0003725 -0.0405439 -0.1083293 -0.0585785 -0.0131558 -0.0505982 -0.0567752 0.0342429 -0.0119086 0.0280204 0.0385724 -0.0075385 -0.0072137 -0.0140899 0.0304771 -0.0640375 0.0600058 0.0587045 -0.0716871 0.0486677 0.0707442 0.0941805 -0.0446717 0.0940722 0.0006439 0.0135968 -0.0380701 0.1033556 -0.0244732 0.0966695 0.0508932 0.1042671 0.0592494 0.031807 -0.0747612 0.0196479 -0.0165523 0.0361544 0.0264535 -0.0642561 -0.0143188 -0.0575597 0.0475901 0.1284656 0.0256697 -0.0516476 0.0027766 -0.0073858 -0.01758 -0.0106416 0.0273726 -0.0741089 -0.0071669 -0.0286256 0.0930415 -0.0360404 0.1188176 0.0750233 0.1042287 0.0749917 0.0052267 0.0533825 0.0456125 -0.0439167 0.0559364 0.0766055 0.1101645 -0.0569306 0.1154274 -0.0163781 -0.1107496 0.0536052 -0.0084861 0.0590029 0.1267182 0.0312932 -0.0067258 0.0321855 0.1085445 unknown
polarizability: 122.6289909|-11.8351679|87.7653872|-7.0404485|1.7234445|93.8298923 unknown
InChI: InChI=1S/C8H8Cl2/c9-6-8(10)7-4-2-1-3-5-7/h1-5,8H,6H2
charge 0 multiplicity 1
18 atoms
Cl 1.966168 -1.962686 -1.139309
Cl 2.335345 1.798697 1.302019
C  1.482994 -0.613199 0.187702
C  0.025357 -0.26616 0.048901
C  -0.886831 -0.717201 1.035886
C  -0.462432 0.496774 -1.043862
C  2.503123 0.493606 -0.061248
C  -2.260351 -0.40244 0.943444
C  -1.833734 0.808961 -1.139385
C  -2.73715 0.361962 -0.145233
H  1.689609 -1.129621 1.136969
H  -0.518141 -1.309727 1.881909
H  0.224572 0.835271 -1.827716
H  3.533543 0.121069 0.010168
H  2.342097 1.022303 -1.010379
H  -2.953943 -0.751089 1.716148
H  -2.201703 1.396916 -1.987291
H  -3.802325 0.606865 -0.221025
