program: Gaussian 09
title: 000156402
version: EM64L-G09RevD.01
frameworkgroup: C1[X(C13H12O3)]
method: RPBEPBE
basis: SDD
operation: Freq
keyword: #pfreq=noraman
keyword: PBEPBE/SDD
title: #p freq=noraman PBEPBE/SDD
converged: YES YES NO NO
title: Mulliken charges:
elementType: O O O C C C C C C C C C C C C C H H H H H H H H H H H H
charge: -0.459792 -0.410467 -0.237665 0.049366 0.382421 0.376071 -0.593192 0.383110 -0.380745 -0.682666 -0.430490 0.129446 -0.419440 -0.407839 -0.243361 -0.240676 0.286679 0.261650 0.232223 0.245963 0.232227 0.235479 0.242964 0.238663 0.364809 0.228731 0.228094 0.388439
chargesum: 0.00000
title: Mulliken charges with hydrogens summed into heavy atoms:
elementType: O O O C C C C C C C C C C C C C
charge: -0.094983 -0.022028 -0.237665 0.049366 0.382421 0.376071 -0.306513 0.383110 -0.119096 0.027747 -0.195011 0.129446 -0.176476 -0.169176 -0.014630 -0.012582
polarizability: 2.25476232e+02 -9.08601325e+00 1.48652314e+02 -6.24396562e+00 5.71006423e+00 8.57634923e+01
1716.lowfreq: -7.7804 -0.0004 0.0005 0.0007 7.3082 12.1514 33.3187 56.7205 88.6275
frequency: 33.3143 56.7007 88.6221 135.5130 164.5623 188.2453 207.8428 221.8936 257.2213 301.5203 332.1706 343.6337 398.3846 406.9222 411.6303 454.4850 483.7930 513.2827 517.5507 531.6383 573.4338 591.4775 624.1109 654.3972 663.7829 722.4955 760.8154 762.2630 790.4705 791.2310 834.0338 879.5524 886.4091 912.8695 941.0534 946.6563 964.3000 981.5987 993.3445 1022.6367 1044.9554 1060.8278 1077.9972 1129.0472 1144.0981 1170.0593 1172.1565 1177.9707 1232.2823 1251.6318 1273.3764 1285.3376 1347.2904 1360.1105 1389.7488 1408.9431 1422.3845 1433.7642 1457.2814 1463.7493 1471.4995 1511.6550 1580.9115 1602.5466 1632.6502 1641.0424 3007.8525 3111.0908 3120.1535 3122.8494 3124.1881 3126.7050 3143.0343 3152.1108 3156.0426 3162.2449 3473.1784 3504.9520
redmass: 5.1145 7.8156 5.5528 5.8171 4.9614 3.7217 2.4648 1.1570 4.7320 5.2342 4.2832 2.8049 2.8648 2.0784 3.1107 2.6379 2.5157 6.8086 3.7870 4.8938 4.6949 1.6691 4.1713 4.0480 2.8960 3.7318 3.3606 1.5861 2.8275 3.8640 1.3611 1.7077 2.8739 2.6922 1.8494 2.4743 1.3930 1.3964 1.3474 2.2910 2.7103 2.5751 1.9087 1.7264 2.2318 1.2551 1.1581 1.7448 2.5581 1.5433 1.7763 1.7854 1.8244 1.7509 1.2220 5.3222 2.7560 4.6250 1.2473 1.7176 1.0935 3.5648 7.4705 5.6394 8.9131 7.0694 1.0346 1.1012 1.0859 1.0986 1.0904 1.0885 1.0951 1.0909 1.0954 1.1004 1.0649 1.0640
irintensity: 0.7801 0.9651 0.7459 2.4354 1.1147 0.7319 0.3331 0.2203 0.5344 26.2473 2.0472 36.8284 21.1172 43.1572 31.4135 23.0285 21.5248 0.1091 4.2824 16.3612 20.5828 82.0150 21.6165 52.7507 20.8354 31.8685 8.4755 49.3139 0.8778 5.2951 52.2837 14.7716 6.0460 13.9211 9.0772 12.9255 8.0560 7.8592 0.1308 3.1226 255.7864 19.2737 56.0694 23.3356 4.1422 2.8013 4.8261 39.4296 1.4431 1.5761 19.8635 50.2105 0.8804 32.2270 13.7476 1.9269 0.8508 0.6588 4.6763 6.7160 11.7107 17.5974 0.0907 18.1675 199.7927 18.9774 15.9629 26.8853 1.8024 19.0628 2.2399 0.8958 31.9068 2.8034 8.5459 35.6840 40.6409 30.9899
temp: 298.150 k
press: 1.00000 atm
elementType: 8 8 8 6 6 6 6 6 6 6 6 6 6 6 6 6 1 1 1 1 1 1 1 1 1 1 1 1
symmnumber: 1
zpe: 569982.2 jmol-1
zpe.correction: 0.217095 hartree
zpe.thermalcorrener: 0.230992 hartree
zpe.thermalcorrenthalpy: 0.231936 hartree
zpe.thermalcorrgfe: 0.176369 hartree
zpe.sumelectzpe: -727.130945 hartree
zpe.sumelectthermal: -727.117048 hartree
zpe.sumelectthermalent: -727.116104 hartree
zpe.sumelectthermalfe: -727.171671 hartree
dipole: 0.2192 2.3343 -0.1783
dipole: 2.3513
quadrupole: -81.9595 -85.2214 -98.4764
quadrupole: -8.4822 -0.7547 -0.7605
quadrupole: 6.5929 3.3310 -9.9240 -8.4822 -0.7547 -0.7605
hfenergy: -727.3480398 hartree
pointgroup: C01 [X(C13H12O3)]
dipole: -0.1758866 0.6100436 0.6728216 debye
polarizability: 223.276416|12.4607081|125.4314912|10.7482416|32.4945964|111.1841313 unknown
InChI: InChI=1S/C13H12O3/c1-13(16,12(14)15)11-7-6-9-4-2-3-5-10(9)8-11/h2-8,14,16H,1H3
charge 0 multiplicity 1
28 atoms
O  2.624448 -1.036703 -1.223186
O  3.332566 0.935253 1.771456
O  3.512177 -1.332061 1.318566
C  2.3799 0.105047 -0.340191
C  0.867625 0.257701 -0.030719
C  -1.463224 -0.429395 -0.443498
C  -0.055046 -0.573097 -0.669971
C  -1.932573 0.596905 0.464566
C  0.400363 1.2778 0.86692
C  2.932862 1.351086 -1.062736
C  -0.964038 1.43832 1.105704
C  3.129247 -0.187936 0.979731
C  -2.42467 -1.272175 -1.0943
C  -3.341443 0.738532 0.690341
C  -3.791822 -1.111346 -0.85648
C  -4.254429 -0.098169 0.04376
H  0.311437 -1.333208 -1.367552
H  1.123874 1.925932 1.372146
H  4.014494 1.238827 -1.246605
H  2.417816 1.441371 -2.033308
H  2.757306 2.264932 -0.473728
H  -1.312141 2.21789 1.79412
H  -2.069043 -2.047244 -1.783637
H  -3.693291 1.515866 1.37936
H  2.818457 -1.830173 -0.651681
H  -4.518114 -1.760115 -1.35826
H  -5.329414 0.016821 0.221312
H  3.784976 0.670939 2.61857
