program: Gaussian 09
title: 000156401
version: EM64L-G09RevD.01
frameworkgroup: C1[X(C13H14O2)]
method: RPBEPBE
basis: SDD
operation: Freq
keyword: #pfreq=noraman
keyword: PBEPBE/SDD
title: #p freq=noraman PBEPBE/SDD
converged: YES YES NO NO
title: Mulliken charges:
elementType: O O C C C C C C C C C C C C C H H H H H H H H H H H H H H
charge: -0.455266 -0.440383 0.129487 0.363667 -0.435815 -0.593188 -0.702527 0.375068 -0.406867 0.373384 -0.419522 -0.429107 -0.406260 -0.243748 -0.241372 0.250730 0.190946 0.236705 0.243966 0.211629 0.229462 0.284903 0.237528 0.352208 0.238810 0.239886 0.229357 0.229375 0.356946
chargesum: 0.00000
title: Mulliken charges with hydrogens summed into heavy atoms:
elementType: O O C C C C C C C C C C C C C
charge: -0.103058 -0.083437 0.129487 0.363667 0.005861 -0.356483 -0.017470 0.375068 -0.121964 0.373384 -0.181994 -0.190298 -0.166375 -0.014392 -0.011997
polarizability: 2.18784663e+02 1.03155235e+01 1.42579329e+02 6.33428660e+00 -1.23106857e+01 8.70208504e+01
1716.lowfreq: -15.9823 -3.3082 -0.0005 -0.0003 0.0006 4.4603 24.7707 60.0682 110.3609
frequency: 24.4121 59.9498 110.2899 164.7963 182.2434 190.8375 197.2656 215.5991 285.9215 334.7201 342.3971 359.2895 394.2352 407.3557 463.2809 479.4405 498.4639 513.2012 528.6199 556.7539 584.7138 613.2961 655.0060 678.7013 758.7850 761.4948 789.1504 819.2064 845.9723 867.0022 876.2888 898.7152 915.0481 940.0085 957.5131 964.1347 987.9518 991.3485 1000.0230 1022.6007 1049.1200 1083.8824 1117.0154 1134.4202 1154.4143 1172.6448 1177.2498 1218.5968 1240.1192 1272.1165 1276.4397 1299.7361 1330.8225 1343.9036 1366.2242 1388.2384 1405.7558 1422.7430 1431.5436 1453.5165 1461.3784 1465.6842 1474.2073 1510.5140 1579.5122 1601.6453 1638.6690 2991.0956 2994.7513 3092.6030 3099.3363 3100.8544 3109.7729 3118.9001 3123.6548 3125.6334 3142.5444 3162.2685 3167.0598 3475.4272 3522.8348
redmass: 4.3776 4.8567 4.7858 3.2816 3.6372 2.5803 1.2601 3.3215 5.3961 3.9546 2.8393 3.2293 1.6788 2.1154 2.6030 2.5017 3.7255 6.6988 2.1727 1.6371 2.9724 5.2664 4.9829 2.9259 1.3177 4.8212 2.6778 4.7827 1.2960 3.3158 1.5177 2.1133 1.6889 3.8266 2.0421 1.3971 2.1958 1.3743 1.3551 2.2958 2.2804 1.7611 1.5284 1.7604 1.2397 1.1032 1.7930 1.7398 1.7341 2.3027 1.8269 1.2827 1.4505 1.8040 1.3051 1.2201 4.7588 3.1853 4.0018 1.1944 1.7310 1.1073 1.1019 3.6814 7.1167 5.6464 6.7768 1.0460 1.0550 1.1000 1.0988 1.0993 1.0902 1.0862 1.0895 1.0886 1.0946 1.1003 1.0944 1.0648 1.0656
irintensity: 0.9261 0.4150 6.2846 2.4517 1.4536 1.6196 0.5716 0.8038 5.3749 4.6579 9.4186 1.3713 33.6364 21.9846 13.4938 25.6767 8.0455 1.9561 26.7268 136.8558 71.1972 11.6111 9.6628 6.1269 58.0973 0.1310 2.5430 12.8373 24.5507 3.8783 44.9179 6.3082 11.3865 4.9758 73.8691 15.6377 10.8392 0.9197 0.3859 5.8831 30.9478 62.9578 29.5646 11.6237 2.6661 0.5523 2.4318 44.6156 2.4756 22.2728 10.9566 37.2219 34.6868 11.2347 27.2096 24.8779 0.7540 1.3227 1.0746 2.2442 0.7842 15.0547 6.9113 16.7387 0.2292 7.0054 1.9601 10.5163 51.8997 8.0118 38.5874 32.6402 13.3928 7.0124 2.9310 6.6777 32.1539 34.0363 5.9020 21.3877 6.5538
temp: 298.150 k
press: 1.00000 atm
elementType: 8 8 6 6 6 6 6 6 6 6 6 6 6 6 6 1 1 1 1 1 1 1 1 1 1 1 1 1 1
symmnumber: 1
zpe: 619264.2 jmol-1
zpe.correction: 0.235865 hartree
zpe.thermalcorrener: 0.249277 hartree
zpe.thermalcorrenthalpy: 0.250221 hartree
zpe.thermalcorrgfe: 0.195749 hartree
zpe.sumelectzpe: -653.143903 hartree
zpe.sumelectthermal: -653.130491 hartree
zpe.sumelectthermalent: -653.129547 hartree
zpe.sumelectthermalfe: -653.184020 hartree
dipole: -2.1845 -1.0778 0.8490
dipole: 2.5797
quadrupole: -88.6471 -83.3223 -92.4928
quadrupole: -2.7570 5.6663 -5.5393
quadrupole: -0.4931 4.8318 -4.3387 -2.7570 5.6663 -5.5393
hfenergy: -653.3797687 hartree
pointgroup: C01 [X(C13H14O2)]
dipole: 0.8808068 -0.4891388 -0.1223611 debye
polarizability: 218.5692554|-4.1118535|142.6972632|13.6437214|-10.8084944|87.1183245 unknown
InChI: InChI=1S/C13H14O2/c1-13(15,9-14)12-7-6-10-4-2-3-5-11(10)8-12/h2-8,14-15H,9H2,1H3
charge 0 multiplicity 1
29 atoms
O  -3.421116 0.999921 -0.148631
O  -2.858814 -0.754356 1.999371
C  -2.613772 -0.212213 -0.406875
C  -1.10963 0.118202 -0.277049
C  -3.056932 -1.272284 0.633207
C  -0.144952 -0.866649 -0.020861
C  -2.963089 -0.64724 -1.84114
C  1.251807 -0.548114 0.059923
C  -0.679247 1.474766 -0.470636
C  1.6725 0.824279 -0.133215
C  0.671172 1.81515 -0.401707
C  2.246513 -1.547607 0.32497
C  3.067957 1.144373 -0.051662
C  3.599417 -1.207276 0.397874
C  4.014141 0.150294 0.208629
H  -4.144231 -1.426018 0.546615
H  -2.54101 -2.242097 0.489652
H  -0.43645 -1.91763 0.106986
H  -2.731877 0.172057 -2.542649
H  -2.380134 -1.536057 -2.140801
H  -4.041446 -0.872509 -1.916656
H  -1.445778 2.230559 -0.66626
H  0.983789 2.855548 -0.552959
H  -3.453086 1.104282 0.842283
H  1.92991 -2.587815 0.469614
H  3.382822 2.184662 -0.197761
H  4.350826 -1.978437 0.600018
H  5.078292 0.403535 0.268642
H  -1.882484 -0.660724 2.157974
