program: Gaussian 09
title: 000156394
version: EM64L-G09RevD.01
frameworkgroup: C1[X(C22H24FN3O3)]
method: RPBEPBE
basis: SDD
operation: Freq
keyword: #p
keyword: freq=noraman
keyword: PBEPBE/SDD
title: #p freq=noraman PBEPBE/SDD
converged: YES YES NO NO
title: Mulliken charges:
elementType: F O O O N N N C C C C C C C C C C C C C C C C C C C C C C H H H H H H H H H H H H H H H H H H H H H H H H
charge: -0.211041 -0.467874 -0.246953 -0.256194 -0.068413 -0.213327 -0.435387 -0.086120 -0.418785 -0.418656 -0.397556 -0.391507 -0.218122 -0.344425 0.429707 -0.368921 -0.385785 -0.349849 0.168638 0.141568 -0.375512 -0.369047 0.106660 0.339034 0.314052 -0.309234 -0.390373 -0.255252 -0.189942 0.212807 0.181989 0.198603 0.215537 0.214955 0.171228 0.221562 0.227769 0.177699 0.201334 0.238328 0.204972 0.254846 0.254917 0.340041 0.232432 0.286876 0.252027 0.252100 0.342966 0.275791 0.235207 0.238763 0.235867
chargesum: 0.00000
title: Mulliken charges with hydrogens summed into heavy atoms:
elementType: F O O O N N N C C C C C C C C C C C C C C C C C C C C C C
charge: -0.211041 -0.127833 -0.246953 -0.256194 -0.068413 -0.213327 -0.092421 0.126687 -0.038193 0.011836 -0.004766 0.013961 -0.016788 0.098875 0.429707 0.140842 -0.153353 -0.062973 0.168638 0.141568 -0.123485 -0.116948 0.106660 0.339034 0.314052 -0.033442 -0.155166 -0.016489 0.045925
polarizability: 3.71662553e+02 -3.40759023e+01 2.53704995e+02 1.46083496e+01 7.73063938e-01 1.82408835e+02
1716.lowfreq: -9.0027 -0.0005 0.0005 0.0007 0.2547 4.7953 9.9141 15.1164 22.2642
frequency: 9.2579 14.5826 22.1341 31.6323 37.0695 43.9420 61.0853 80.4395 98.3041 109.3603 117.9833 159.6560 167.9449 185.7205 206.9875 228.0288 243.3399 261.4906 265.6935 270.9892 296.5779 312.5881 324.7406 342.9424 361.0889 370.1020 382.5563 391.1633 406.8104 413.0767 437.0395 440.5650 445.0000 469.0102 484.7377 520.4477 527.3713 534.2873 547.0836 574.1402 627.0582 628.1838 632.2509 664.3606 678.8780 681.3873 709.5367 719.2326 724.0552 757.0595 761.4302 768.2769 773.7586 784.0513 803.1383 811.0413 818.9009 828.4142 846.4998 874.5549 886.2670 909.0918 926.2369 938.6599 945.3263 969.9901 974.2096 978.8318 980.7037 998.9014 1006.7633 1022.3702 1024.5163 1034.7695 1053.8320 1072.5323 1098.5074 1102.5441 1104.4870 1112.6875 1117.8199 1134.0096 1143.9211 1152.2751 1154.0614 1161.9859 1172.6052 1188.1245 1194.3789 1214.9189 1218.8258 1245.6012 1249.7768 1252.9015 1271.1401 1274.1152 1274.6728 1290.7626 1292.3513 1303.6536 1316.4344 1321.2877 1332.9467 1342.9803 1349.5495 1353.2955 1363.4496 1374.1203 1378.6315 1387.2783 1391.1224 1396.6147 1403.1603 1418.5288 1439.8674 1446.6027 1462.6520 1464.8218 1474.5428 1481.1709 1483.4359 1484.4030 1495.0284 1582.7854 1603.3173 1604.8376 1614.1779 1628.0973 1653.4736 2822.1879 2832.9578 2888.3025 2912.3008 2950.6444 2956.2485 2998.2534 3021.4851 3031.9580 3041.2692 3045.1387 3058.8153 3062.1032 3124.4088 3129.4400 3131.0321 3147.6404 3158.7736 3163.9141 3173.0422 3175.7326 3185.7757 3554.0142 3575.9229
redmass: 6.6141 7.1817 4.9927 6.5716 4.3535 4.3777 4.7232 3.6831 6.1901 6.6448 5.2206 6.4427 4.6486 4.5381 3.8818 3.2458 2.1837 3.8369 1.2274 4.8048 3.3761 4.2100 5.2902 2.5904 4.0336 3.1429 9.6943 3.3989 3.5623 3.0205 3.7248 4.2332 8.5331 3.1783 3.2587 2.8767 3.5523 4.7082 9.7076 3.2615 5.9553 1.3820 5.0824 6.8876 3.8201 3.8126 4.7923 3.5043 5.2501 3.9001 2.7305 2.1629 1.5454 2.0612 2.4972 1.5500 1.3457 3.4161 1.7287 1.4615 5.1555 4.1731 2.4934 1.6658 1.6063 1.3696 1.5704 1.6151 1.8757 1.3329 2.7476 2.6216 2.9530 2.2794 3.4738 2.2604 2.2319 2.1996 1.4231 2.7845 2.1667 1.5720 1.8358 2.2005 1.4641 1.7226 1.1146 1.8086 2.0982 2.0655 1.8419 1.9270 1.4604 1.7074 1.2801 1.7415 1.3656 1.3647 1.2921 1.3137 1.3410 1.3321 1.3465 1.4560 1.6248 1.7053 1.8975 2.3341 1.4815 2.8296 2.9996 1.4741 2.9147 2.8512 1.1114 1.0956 1.0920 1.0813 1.0909 3.1359 2.3560 1.2110 2.7663 7.8071 7.8194 8.9983 6.4769 6.9019 5.7968 1.0715 1.0705 1.0701 1.0831 1.0723 1.0702 1.0600 1.1004 1.0883 1.0878 1.0892 1.0598 1.1017 1.0897 1.1068 1.0876 1.0898 1.0939 1.0893 1.0952 1.1002 1.0962 1.0774 1.0655
irintensity: 0.1980 0.0877 0.6628 0.4690 1.7157 1.6703 0.3364 0.5013 0.0346 2.9788 0.0413 1.9802 2.2447 0.9484 0.7146 2.8725 10.2856 12.2805 163.5684 3.9556 26.9293 2.6986 0.9140 4.7439 14.3443 2.6845 12.6442 7.7537 2.9511 1.4411 1.5276 10.8649 4.6802 5.5911 1.9493 15.2795 21.9062 15.9837 1.8917 18.2747 3.7819 51.5697 2.4978 11.5809 8.8427 11.1686 7.0627 3.4694 39.0440 29.3488 68.2814 25.9830 4.6038 35.4606 15.5647 8.1690 3.4454 13.6901 52.9689 1.0742 1.7627 1.8702 20.2749 16.5704 6.5987 2.8034 11.9683 8.3140 17.7763 0.1316 11.4049 14.6257 13.9020 1.3100 16.4736 31.9552 26.1661 10.8007 13.3928 18.5216 3.2426 70.7354 25.2050 37.2976 41.8241 13.1752 1.6934 1.7652 43.5031 21.2397 18.7862 1.2852 9.7911 24.2838 12.3804 4.8506 6.7772 25.2708 9.5916 2.1172 1.2463 40.6998 11.0546 15.1073 65.7530 4.6449 156.9313 8.9052 68.0840 18.7414 7.9922 19.7398 3.3050 53.0388 38.1560 5.5636 10.7770 0.6586 4.5952 63.4115 16.7529 9.3688 109.4046 150.9995 7.8540 228.1192 12.7055 123.9891 486.7769 56.5693 111.6399 85.9746 47.1807 22.8679 47.3104 18.5772 57.8728 31.2824 27.6497 17.5154 17.0394 35.5547 13.7415 1.2425 4.5114 9.3639 6.8317 2.8853 4.6954 20.5551 2.1167 57.0588 2.1438
temp: 298.150 k
press: 1.00000 atm
elementType: 9 8 8 8 7 7 7 6 6 6 6 6 6 6 6 6 6 6 6 6 6 6 6 6 6 6 6 6 6 1 1 1 1 1 1 1 1 1 1 1 1 1 1 1 1 1 1 1 1 1 1 1 1
symmnumber: 1
zpe: 1116882.3 jmol-1
zpe.correction: 0.425398 hartree
zpe.thermalcorrener: 0.451099 hartree
zpe.thermalcorrenthalpy: 0.452043 hartree
zpe.thermalcorrgfe: 0.365748 hartree
zpe.sumelectzpe: -1340.435138 hartree
zpe.sumelectthermal: -1340.409437 hartree
zpe.sumelectthermalent: -1340.408493 hartree
zpe.sumelectthermalfe: -1340.494788 hartree
dipole: 6.5634 -0.4032 2.6597
dipole: 7.0933
quadrupole: -160.0091 -171.5123 -166.3158
quadrupole: 27.0984 -0.5463 -2.9135
quadrupole: 5.9367 -5.5666 -0.3700 27.0984 -0.5463 -2.9135
hfenergy: -1340.8605359 hartree
pointgroup: C01 [X(C22H24F1N3O3)]
dipole: 2.5827482 -0.1757739 1.0424205 debye
polarizability: 371.1166741|-35.0212373|254.3111288|14.4333005|0.3485267|182.3485804 unknown
InChI: InChI=1S/C22H24FN3O3/c23-17-7-5-15(6-8-17)20(27)16-9-11-25(12-10-16)13-14-26-21(28)18-3-1-2-4-19(18)24-22(26)29/h1-8,16,20,24,27H,9-14H2
charge 0 multiplicity 1
53 atoms
F  -8.374788 2.721521 0.270559
O  -4.569759 -2.081331 -1.420002
O  4.015359 -2.053396 -0.472229
O  2.529628 2.401714 -0.401165
N  -0.282433 -0.967916 0.251262
N  3.273362 0.16531 -0.472171
N  4.783443 1.952724 -0.040745
C  -3.210319 -1.198126 0.500591
C  -2.262641 -2.420119 0.607273
C  -2.543674 -0.088647 -0.34559
C  -0.873662 -2.001854 1.130801
C  -1.137961 0.244574 0.191714
C  -4.621434 -1.611105 -0.025738
C  1.133027 -0.664369 0.548602
C  -5.630692 -0.47012 0.031048
C  1.888147 -0.296443 -0.752883
C  -6.114219 -0.02892 1.288799
C  -6.089011 0.168972 -1.146315
C  4.293758 -0.824908 -0.346309
C  3.466064 1.559511 -0.30996
C  -7.030757 1.04104 1.382156
C  -7.008408 1.239763 -1.076013
C  5.654256 -0.311811 -0.069147
C  5.87735 1.084983 0.082284
C  -7.454609 1.652974 0.189787
C  6.742134 -1.211399 0.052703
C  7.180922 1.574099 0.35348
C  8.036177 -0.731158 0.31953
C  8.249066 0.665388 0.469567
H  -3.362902 -0.804423 1.52939
H  -2.113799 -2.880352 -0.39251
H  -2.697069 -3.190355 1.276036
H  -3.166045 0.825656 -0.334974
H  -2.465348 -0.425554 -1.396306
H  -0.979589 -1.636697 2.18754
H  -0.197895 -2.876399 1.149546
H  -0.654348 0.994531 -0.459215
H  -1.231231 0.71011 1.209047
H  -4.982396 -2.440918 0.625802
H  1.610085 -1.559017 0.987348
H  1.239005 0.170813 1.282747
H  1.370216 0.518978 -1.280443
H  1.951272 -1.184292 -1.400184
H  -3.876491 -2.784098 -1.490548
H  -5.782578 -0.525897 2.208757
H  -5.729412 -0.193616 -2.112387
H  -7.414675 1.390169 2.345061
H  -7.374641 1.741779 -1.976364
H  4.909924 2.96089 0.068757
H  6.534706 -2.279554 -0.067882
H  7.352087 2.650426 0.470247
H  8.87581 -1.426638 0.41186
H  9.255488 1.044209 0.678087
