program: Gaussian 09
title: 000156386
version: EM64L-G09RevD.01
frameworkgroup: C1[X(C23H25BrFN3O2)]
method: RPBEPBE
basis: SDD
operation: Freq
keyword: #p
keyword: freq=noraman
keyword: PBEPBE/SDD
title: #p freq=noraman PBEPBE/SDD
converged: YES YES NO NO
title: Mulliken charges:
elementType: Br F O O N N N C C C C C C C C C C C C C C C C C C C C C C C H H H H H H H H H H H H H H H H H H H H H H H H H
charge: -0.013088 -0.193572 -0.241436 -0.228970 -0.266648 -0.101565 -0.370960 0.280218 -0.487716 -0.479484 -0.378925 -0.379123 0.080816 -0.335426 -0.360121 0.413179 -0.448490 -0.365136 -0.343559 -0.511415 -0.187025 -0.207337 0.129361 -0.250097 0.302783 -0.311900 -0.324089 -0.384992 -0.369116 0.331004 0.242495 0.213595 0.213568 0.245831 0.205261 0.237646 0.228464 0.213210 0.233181 0.235821 0.325995 0.246391 0.192230 0.234637 0.200333 0.236055 0.255646 0.250921 0.236288 0.244673 0.246319 0.254202 0.284069 0.263779 0.262218
chargesum: 0.00000
title: Mulliken charges with hydrogens summed into heavy atoms:
elementType: Br F O O N N N C C C C C C C C C C C C C C C C C C C C C C C
charge: -0.013088 -0.193572 -0.241436 -0.228970 -0.266648 -0.101565 -0.044965 0.280218 -0.031626 -0.020086 0.063983 0.062551 0.080816 0.133576 0.078501 0.413179 -0.013520 -0.129080 -0.087913 -0.024206 0.057647 0.038982 0.129361 -0.250097 0.302783 -0.057698 -0.040020 -0.121213 -0.106898 0.331004
polarizability: 3.61893206e+02 5.19533659e+01 3.14066150e+02 -7.93359866e+00 1.13438702e+01 1.83788729e+02
1716.lowfreq: -9.2721 -6.6285 -0.0003 -0.0002 0.0004 1.9904 5.9021 9.0293 16.2247
frequency: 3.0312 8.2371 16.1482 28.9152 38.9558 49.4703 59.0467 82.5909 87.3710 99.6851 106.8486 123.4811 146.1340 156.2588 178.2037 194.9851 205.9975 211.1136 216.7440 266.7521 278.2373 280.7389 289.5166 291.9203 308.3528 314.9956 345.5341 371.1325 376.6368 391.9441 396.5735 410.5867 422.0071 422.9433 456.9680 468.4249 473.4365 493.7245 511.8186 531.1988 553.8647 560.0544 565.7228 588.2080 622.5573 624.4635 656.3383 673.7408 693.6284 699.0879 715.9332 720.7305 724.0008 746.1623 791.2077 798.0447 804.1817 818.1232 822.9057 830.7061 840.0338 852.1847 876.9342 920.2471 927.4649 940.9514 950.1286 955.8469 962.9671 976.0769 982.0732 984.7938 990.5136 1004.6756 1012.9749 1031.3648 1039.9422 1047.3819 1073.3123 1077.8111 1082.6776 1093.9415 1104.4675 1114.3871 1120.6416 1124.4020 1143.5612 1153.9170 1157.0745 1176.7072 1180.7359 1186.4424 1191.9842 1201.3584 1206.3824 1213.3402 1233.6920 1241.4629 1268.1408 1276.5380 1289.6858 1297.9001 1300.0836 1311.0766 1325.7900 1331.0921 1334.6813 1346.0605 1347.8109 1354.2631 1364.5082 1367.9847 1376.1205 1379.5155 1391.1801 1408.6987 1412.8234 1413.7142 1420.6918 1457.8417 1461.7141 1467.1890 1471.6001 1478.4154 1488.8901 1489.3769 1489.5833 1523.0113 1561.9773 1571.8819 1599.6402 1610.7052 1612.5441 1664.2770 2870.4158 2900.0229 2904.2031 2909.8986 2941.0713 2965.8923 2998.6708 3004.3844 3007.0979 3019.7459 3032.5337 3041.0981 3044.2515 3062.9016 3073.3893 3080.3812 3147.7230 3152.4517 3153.1679 3157.6052 3168.6924 3174.7304 3175.1150 3179.5923 3585.4160
redmass: 9.0388 9.4585 7.4185 5.1747 5.7263 5.2390 4.7890 4.8633 5.0483 6.2140 8.6083 4.8107 5.7258 3.1515 4.9526 5.5630 2.6878 5.1745 3.2109 3.0953 2.6407 5.7706 5.3759 5.1838 2.9904 3.0825 2.9390 4.6073 4.5059 2.6732 3.8940 2.9546 4.4301 3.4358 3.7657 3.5317 3.1363 3.0668 2.8136 2.4475 1.1840 3.6495 3.0007 4.9272 7.0605 7.1894 3.7255 6.5783 2.6566 3.2094 6.8470 6.4454 3.7811 3.2954 1.5217 4.6434 1.5564 1.4753 1.3631 1.6493 2.9829 1.8372 2.9252 3.0022 1.3255 2.2469 1.6929 1.3122 1.7910 4.4051 3.6834 2.4891 1.5523 2.5296 2.9810 1.5901 1.8490 2.1631 2.4478 2.2985 1.4471 2.1683 1.3579 2.9546 4.3323 1.6867 2.0271 1.7457 1.8892 1.1169 2.6508 1.2625 1.1298 2.1333 1.1654 2.0498 1.9390 1.9279 1.4530 1.2732 1.2813 1.5330 1.7581 1.4372 1.3160 2.0127 1.3780 1.5522 1.5352 1.4944 1.3823 3.1842 2.7006 5.2524 1.4387 3.2796 1.2434 2.0118 2.5716 1.0871 1.0843 1.0795 1.1245 1.0806 1.1674 2.5727 2.2794 1.1038 7.1978 7.7989 7.1384 6.1188 7.1877 7.7681 1.0712 1.0707 1.0685 1.0548 1.1081 1.0597 1.0648 1.0634 1.0655 1.0960 1.0905 1.0901 1.0892 1.0982 1.0983 1.0972 1.0871 1.0886 1.0882 1.0890 1.0960 1.0961 1.0965 1.0974 1.0792
irintensity: 0.2649 0.0932 0.1027 0.6115 0.0174 0.1737 4.6676 2.2509 1.2284 1.8899 3.4300 5.4706 0.0874 1.4968 1.2945 1.7462 3.9306 3.5201 7.1992 0.5074 1.6942 1.5387 5.3790 0.4444 3.0072 6.3682 4.2370 2.0326 3.1585 2.0097 24.1195 0.0613 10.1458 3.3961 0.5096 7.3208 1.3112 7.2749 21.0603 1.1343 114.7903 5.2597 9.7616 14.1427 0.1930 0.7870 6.3784 18.0814 13.8628 0.3438 4.4632 15.3417 0.8586 4.8360 38.1355 13.1263 1.8575 69.1023 25.9872 20.6108 14.6560 40.1415 5.3977 19.1745 0.1926 1.7821 9.3297 0.5496 18.6588 8.1600 56.4566 6.3566 1.2878 0.8795 13.9972 1.9769 5.6091 6.4766 24.0456 14.2698 2.4117 23.9507 7.6617 25.5023 5.1181 0.2026 8.7354 77.8694 24.8272 4.6338 48.0478 22.1699 5.5747 10.3470 18.8850 78.3607 80.9603 70.7749 22.3825 11.4138 2.3765 27.9230 41.6596 12.5500 1.2598 7.0889 20.2954 29.4925 11.8482 25.9151 4.1896 134.9440 89.6663 15.7588 8.7991 16.8982 21.0631 23.9106 16.4071 21.2961 7.8013 1.8276 10.3599 18.5600 10.0990 17.3074 315.6073 5.2822 3.9464 93.2116 76.2194 122.2027 31.0376 347.5280 93.3731 36.1616 119.7378 92.4297 43.2342 44.0574 28.2108 26.4832 21.3577 12.8491 33.0003 29.6497 12.9078 31.7542 19.2280 26.4560 11.6431 4.3489 4.2228 0.0926 13.4789 1.5308 3.4742 4.0759 48.9686
temp: 298.150 k
press: 1.00000 atm
elementType: 35 9 8 8 7 7 7 6 6 6 6 6 6 6 6 6 6 6 6 6 6 6 6 6 6 6 6 6 6 6 1 1 1 1 1 1 1 1 1 1 1 1 1 1 1 1 1 1 1 1 1 1 1 1 1
symmnumber: 1
zpe: 1151517.2 jmol-1
zpe.correction: 0.438590 hartree
zpe.thermalcorrener: 0.466129 hartree
zpe.thermalcorrenthalpy: 0.467073 hartree
zpe.thermalcorrgfe: 0.374853 hartree
zpe.sumelectzpe: -1317.256030 hartree
zpe.sumelectthermal: -1317.228491 hartree
zpe.sumelectthermalent: -1317.227547 hartree
zpe.sumelectthermalfe: -1317.319767 hartree
dipole: -3.5100 2.3528 1.2583
dipole: 4.4090
quadrupole: -193.6595 -190.9859 -181.0076
quadrupole: -28.0979 1.0908 -6.1288
quadrupole: -5.1085 -2.4349 7.5434 -28.0979 1.0908 -6.1288
hfenergy: -1317.69462 hartree
pointgroup: C01 [X(C23H25Br1F1N3O2)]
dipole: 1.6400919 -0.1529436 -0.5437405 debye
polarizability: 292.2253061|-36.6328062|381.8107208|-14.9644687|-13.5696525|185.7120578 unknown
InChI: InChI=1S/C23H25BrFN3O2/c24-18-5-9-20(10-6-18)28-16-26-22(30)23(28)11-14-27(15-12-23)13-1-2-21(29)17-3-7-19(25)8-4-17/h3-10,26H,1-2,11-16H2
charge 0 multiplicity 1
55 atoms
Br 0.335337 5.571148 -0.651505
F  -5.148259 3.775262 0.623765
O  4.071629 -3.33851 0.395922
O  -3.786578 -2.489605 0.774159
N  3.342432 0.170148 0.05298
N  0.216845 -2.681296 0.008664
N  5.129676 -1.236171 0.319587
C  2.767455 -1.208013 0.115718
C  2.07088 -1.60285 -1.229815
C  1.848191 -1.399857 1.369405
C  1.178227 -2.854065 -1.109728
C  0.964885 -2.660949 1.291973
C  4.035449 -2.082782 0.29319
C  4.813021 0.182682 0.172004
C  -0.894567 -3.667998 0.001869
C  2.640811 1.371327 -0.109196
C  -1.912699 -3.42603 -1.139187
C  3.354575 2.610065 -0.173997
C  1.213292 1.429917 -0.212151
C  -2.423313 -1.973542 -1.185314
C  2.683088 3.839267 -0.334127
C  0.544554 2.659209 -0.366644
C  -3.373935 -1.61238 -0.042657
C  1.279065 3.859872 -0.430385
C  -3.821545 -0.181556 0.09641
C  -3.386355 0.84731 -0.783903
C  -4.712554 0.146781 1.155675
C  -3.825716 2.1768 -0.614604
C  -5.162779 1.466665 1.341709
C  -4.705182 2.453214 0.447635
H  1.449656 -0.758489 -1.572038
H  2.848712 -1.766991 -1.999895
H  2.48358 -1.442598 2.274504
H  1.195067 -0.51886 1.475771
H  0.620882 -2.980568 -2.055156
H  1.807457 -3.763971 -0.961751
H  1.593792 -3.575298 1.409962
H  0.238997 -2.638455 2.125718
H  5.295758 0.615773 -0.732356
H  5.14747 0.77073 1.055256
H  6.080909 -1.586441 0.429695
H  -1.427269 -3.57658 0.964999
H  -0.516889 -4.718652 -0.067677
H  -2.76045 -4.118195 -0.982389
H  -1.462714 -3.679421 -2.118397
H  4.445828 2.631612 -0.100794
H  0.60713 0.522748 -0.163982
H  -1.548491 -1.293976 -1.145568
H  -2.946507 -1.770533 -2.142783
H  3.25809 4.768785 -0.381253
H  -0.548183 2.671124 -0.426215
H  -2.70556 0.617665 -1.609155
H  -5.036816 -0.658683 1.822308
H  -3.504759 2.982805 -1.281099
H  -5.84702 1.737105 2.15084
