program: Gaussian 09
title: 000156382
version: EM64L-G09RevD.01
frameworkgroup: C1[X(C10H13NO4)]
method: RPBEPBE
basis: SDD
operation: Freq
keyword: #p
keyword: freq=noraman
keyword: PBEPBE/SDD
title: #p freq=noraman PBEPBE/SDD
converged: YES YES NO NO
title: Mulliken charges:
elementType: O O O O N C C C C C C C C C C H H H H H H H H H H H H H
charge: -0.238305 -0.189692 -0.189697 -0.335699 -0.123270 0.167344 0.167345 -0.185695 -0.185690 -0.453245 -0.453248 0.148023 0.148020 -0.767369 -0.767371 0.285722 0.285722 0.245015 0.215818 0.215813 0.245016 0.254397 0.218533 0.221776 0.221774 0.218533 0.254399 0.376032
chargesum: 0.00000
title: Mulliken charges with hydrogens summed into heavy atoms:
elementType: O O O O N C C C C C C C C C C
charge: -0.238305 -0.189692 -0.189697 0.040333 -0.123270 0.167344 0.167345 0.100027 0.100032 0.007588 0.007581 0.148023 0.148020 -0.072663 -0.072665
polarizability: 1.30079972e+02 -2.85369295e-04 1.28508069e+02 -1.82680958e+00 -2.89105477e-04 9.55039750e+01
1716.lowfreq: -148.1130 -16.2537 -0.0005 -0.0001 0.0005 5.9126 14.3626 57.5887 93.7329
frequency: -148.1066 57.5325 93.7168 145.3969 148.6220 185.0081 227.0012 247.4534 262.1280 270.3096 279.9428 297.0852 307.4057 307.6357 322.3333 383.6865 486.8682 512.9988 523.9935 552.3286 576.1936 651.2740 693.4384 698.0206 757.2893 774.7421 787.5401 817.5270 829.2463 870.7361 910.5477 911.1878 943.1003 945.1097 966.0356 976.1142 1017.0020 1021.7136 1078.9420 1106.9998 1130.1605 1139.1120 1145.5976 1171.7906 1184.7815 1196.7242 1208.8679 1217.6894 1226.9305 1238.4753 1263.8264 1284.3117 1285.0791 1306.7666 1368.6873 1387.5743 1401.2245 1456.0367 1467.7534 1475.5220 1481.1165 1483.0461 1497.0063 1644.2499 1701.6795 2993.1479 2996.3388 3030.6271 3042.5284 3081.1892 3084.8055 3086.6701 3098.6628 3100.8869 3106.1189 3112.3407 3119.3210 3475.8436
redmass: 1.0503 4.5198 7.4237 8.2459 3.4753 1.0834 1.3327 3.1196 2.3785 2.9212 11.9140 3.0491 2.1060 4.0903 4.1945 4.9584 4.3678 4.5320 8.0044 4.1437 7.4012 4.5703 6.6469 6.1931 5.1056 4.4056 2.3861 2.0195 2.9229 2.1857 3.8537 4.3619 2.3084 2.3063 3.7289 2.4729 1.5143 2.1526 1.7167 2.6916 2.1251 5.7416 1.7832 2.5294 2.8391 1.2571 1.6410 1.5524 3.0510 2.4361 1.9276 1.4178 1.6287 1.4023 1.5665 1.1988 1.1922 1.0621 1.0563 1.0754 1.0615 1.0500 1.0691 12.2205 12.1563 1.0361 1.0362 1.0590 1.0623 1.1016 1.1020 1.0989 1.1000 1.1025 1.1014 1.0886 1.0945 1.0684
irintensity: 103.6997 0.0262 6.0202 3.3867 0.0438 0.0434 0.1243 0.5870 0.2801 2.5179 0.3614 0.2655 0.1050 15.9190 4.5034 5.9595 0.1714 10.4838 16.4905 3.3227 6.8025 4.0517 2.2019 0.0727 1.3404 2.0632 15.2651 5.5251 16.5446 22.4143 5.5127 13.2994 8.7413 0.4803 148.6148 22.6755 0.5266 1.5902 3.0418 8.7147 4.9364 79.6904 8.6474 8.5146 40.1016 3.9115 42.1703 1.6513 2.3465 26.0889 1.5115 1.3971 1.7947 0.6012 73.7880 16.9656 23.6016 16.1004 0.4022 7.2299 0.2714 22.2625 22.3550 526.3674 27.8840 3.6159 31.7130 25.7106 33.9704 1.5507 6.8562 33.4974 6.2848 26.7022 27.1461 19.3407 6.2388 27.6514
temp: 298.150 k
press: 1.00000 atm
elementType: 8 8 8 8 7 6 6 6 6 6 6 6 6 6 6 1 1 1 1 1 1 1 1 1 1 1 1 1
symmnumber: 1
zpe: 578015.8 jmol-1
zpe.correction: 0.220155 hartree
zpe.thermalcorrener: 0.233311 hartree
zpe.thermalcorrenthalpy: 0.234255 hartree
zpe.thermalcorrgfe: 0.181533 hartree
zpe.sumelectzpe: -743.327799 hartree
zpe.sumelectthermal: -743.314642 hartree
zpe.sumelectthermalent: -743.313698 hartree
zpe.sumelectthermalfe: -743.366420 hartree
dipole: -3.5640 -0.0002 4.2041
dipole: 5.5115
quadrupole: -79.3784 -99.1411 -89.6930
quadrupole: -0.0009 5.9740 -0.0002
quadrupole: 10.0258 -9.7369 -0.2888 -0.0009 5.9740 -0.0002
hfenergy: -743.5479536 hartree
pointgroup: C01 [X(C10H13N1O4)]
dipole: 1.3402098 0.0004753 -1.7046501 debye
polarizability: 129.8981777|0.0012581|128.508066|-3.0967594|0.0103321|95.685773 unknown
InChI: InChI=1S/C10H13NO4/c1-9-5-3-4-6(15-5)10(9,2)8(13)11(14)7(9)12/h5-6,14H,3-4H2,1-2H3
charge 0 multiplicity 1
28 atoms
O  0.926161 -0.000522 1.616947
O  -1.607747 2.353198 0.105548
O  -1.607714 -2.353289 0.104102
O  -3.164733 -0.000256 0.764378
N  -1.887699 -0.000059 0.133578
C  0.256929 0.796919 -0.51922
C  0.256938 -0.796603 -0.519729
C  1.251706 1.105275 0.663781
C  1.25172 -1.105706 0.663072
C  2.719472 0.785553 0.276078
C  2.719482 -0.785712 0.27557
C  -1.156815 1.199841 -0.053484
C  -1.156803 -1.199828 -0.054234
C  0.566358 1.517195 -1.844571
C  0.566341 -1.516015 -1.845551
H  1.075093 2.070775 1.157261
H  1.075121 -2.071523 1.155934
H  3.395834 1.182234 1.050879
H  3.020682 1.222725 -0.689872
H  3.020683 -1.222259 -0.690667
H  3.395865 -1.182892 1.050097
H  0.536009 2.610259 -1.69221
H  1.558448 1.243711 -2.23948
H  -0.182137 1.269098 -2.618034
H  -0.182097 -1.26731 -2.618874
H  1.558477 -1.242376 -2.240242
H  0.535868 -2.609179 -1.69393
H  -3.836641 -0.000154 0.026873
